{"text_format":"1","workbook":"xlsx","n_sheets":4,"sheets":["Periodövertid","Instruktion","Makroaktivering","Helgdagar"],"not_rendered":{"charts":0,"images":4,"macros":1,"external_links":5,"defined_names":43,"comments":0,"pivot_tables":0},"unopened":[],"bounds":{"document_bytes":16777216,"sheet_cells":100000,"rows_first":2000,"rows_last":500,"rows_between":2000,"halvings":0,"cell_chars":16384,"cell_head_chars":4096},"cells_cut":0,"cells_raw":0,"read":"whole","date_system":"1900"}

{"sheet":"Periodövertid","index":0,"n_rows":381,"n_cols":10,"rows_kept":381,"cut":false,"hidden":true,"merged":[[0,1,1,1],[15,6,15,9],[16,6,16,9],[17,6,17,9],[18,6,18,9],[24,6,24,9],[25,6,25,9],[26,6,26,9],[27,6,27,9],[28,6,28,9],[19,6,19,9],[20,6,20,9],[21,6,21,9],[22,6,22,9],[23,6,23,9],[34,6,34,9],[35,6,35,9],[36,6,36,9],[37,6,37,9],[38,6,38,9],[29,6,29,9],[30,6,30,9],[31,6,31,9],[32,6,32,9],[33,6,33,9],[44,6,44,9],[45,6,45,9],[46,6,46,9],[47,6,47,9],[48,6,48,9],[39,6,39,9],[40,6,40,9],[41,6,41,9],[42,6,42,9],[43,6,43,9],[54,6,54,9],[55,6,55,9],[56,6,56,9],[57,6,57,9],[58,6,58,9],[49,6,49,9],[50,6,50,9],[51,6,51,9],[52,6,52,9],[53,6,53,9],[64,6,64,9],[65,6,65,9],[66,6,66,9],[67,6,67,9],[68,6,68,9],[59,6,59,9],[60,6,60,9],[61,6,61,9],[62,6,62,9],[63,6,63,9],[74,6,74,9],[75,6,75,9],[76,6,76,9],[77,6,77,9],[78,6,78,9],[69,6,69,9],[70,6,70,9],[71,6,71,9],[72,6,72,9],[73,6,73,9],[84,6,84,9],[85,6,85,9],[86,6,86,9],[87,6,87,9],[88,6,88,9],[79,6,79,9],[80,6,80,9],[81,6,81,9],[82,6,82,9],[83,6,83,9],[94,6,94,9],[95,6,95,9],[96,6,96,9],[97,6,97,9],[98,6,98,9],[89,6,89,9],[90,6,90,9],[91,6,91,9],[92,6,92,9],[93,6,93,9],[104,6,104,9],[105,6,105,9],[106,6,106,9],[107,6,107,9],[108,6,108,9],[99,6,99,9],[100,6,100,9],[101,6,101,9],[102,6,102,9],[103,6,103,9],[114,6,114,9],[115,6,115,9],[116,6,116,9],[117,6,117,9],[118,6,118,9],[109,6,109,9],[110,6,110,9],[111,6,111,9],[112,6,112,9],[113,6,113,9],[124,6,124,9],[125,6,125,9],[126,6,126,9],[127,6,127,9],[128,6,128,9],[119,6,119,9],[120,6,120,9],[121,6,121,9],[122,6,122,9],[123,6,123,9],[134,6,134,9],[135,6,135,9],[136,6,136,9],[137,6,137,9],[138,6,138,9],[129,6,129,9],[130,6,130,9],[131,6,131,9],[132,6,132,9],[133,6,133,9],[144,6,144,9],[145,6,145,9],[146,6,146,9],[147,6,147,9],[148,6,148,9],[139,6,139,9],[140,6,140,9],[141,6,141,9],[142,6,142,9],[143,6,143,9],[154,6,154,9],[155,6,155,9],[156,6,156,9],[157,6,157,9],[158,6,158,9],[149,6,149,9],[150,6,150,9],[151,6,151,9],[152,6,152,9],[153,6,153,9],[164,6,164,9],[165,6,165,9],[166,6,166,9],[167,6,167,9],[168,6,168,9],[159,6,159,9],[160,6,160,9],[161,6,161,9],[162,6,162,9],[163,6,163,9],[174,6,174,9],[175,6,175,9],[176,6,176,9],[177,6,177,9],[178,6,178,9],[169,6,169,9],[170,6,170,9],[171,6,171,9],[172,6,172,9],[173,6,173,9],[184,6,184,9],[185,6,185,9],[186,6,186,9],[187,6,187,9],[188,6,188,9],[179,6,179,9],[180,6,180,9],[181,6,181,9],[182,6,182,9],[183,6,183,9],[194,6,194,9],[195,6,195,9],[196,6,196,9],[197,6,197,9],[198,6,198,9],[189,6,189,9],[190,6,190,9],[191,6,191,9],[192,6,192,9],[193,6,193,9],[204,6,204,9],[205,6,205,9],[206,6,206,9],[207,6,207,9],[208,6,208,9],[199,6,199,9],[200,6,200,9],[201,6,201,9],[202,6,202,9],[203,6,203,9],[214,6,214,9],[215,6,215,9],[216,6,216,9],[217,6,217,9],[218,6,218,9],[209,6,209,9],[210,6,210,9],[211,6,211,9],[212,6,212,9],[213,6,213,9],[224,6,224,9],[225,6,225,9],[226,6,226,9],[227,6,227,9],[228,6,228,9],[219,6,219,9],[220,6,220,9],[221,6,221,9],[222,6,222,9],[223,6,223,9],[234,6,234,9],[235,6,235,9],[236,6,236,9],[237,6,237,9],[238,6,238,9],[229,6,229,9],[230,6,230,9],[231,6,231,9],[232,6,232,9],[233,6,233,9],[244,6,244,9],[245,6,245,9],[246,6,246,9],[247,6,247,9],[248,6,248,9],[239,6,239,9],[240,6,240,9],[241,6,241,9],[242,6,242,9],[243,6,243,9],[254,6,254,9],[255,6,255,9],[256,6,256,9],[257,6,257,9],[258,6,258,9],[249,6,249,9],[250,6,250,9],[251,6,251,9],[252,6,252,9],[253,6,253,9],[264,6,264,9],[265,6,265,9],[266,6,266,9],[267,6,267,9],[268,6,268,9],[259,6,259,9],[260,6,260,9],[261,6,261,9],[262,6,262,9],[263,6,263,9],[274,6,274,9],[275,6,275,9],[276,6,276,9],[277,6,277,9],[278,6,278,9],[269,6,269,9],[270,6,270,9],[271,6,271,9],[272,6,272,9],[273,6,273,9],[284,6,284,9],[285,6,285,9],[286,6,286,9],[287,6,287,9],[288,6,288,9],[279,6,279,9],[280,6,280,9],[281,6,281,9],[282,6,282,9],[283,6,283,9],[294,6,294,9],[295,6,295,9],[296,6,296,9],[297,6,297,9],[298,6,298,9],[289,6,289,9],[290,6,290,9],[291,6,291,9],[292,6,292,9],[293,6,293,9],[304,6,304,9],[305,6,305,9],[306,6,306,9],[307,6,307,9],[308,6,308,9],[299,6,299,9],[300,6,300,9],[301,6,301,9],[302,6,302,9],[303,6,303,9],[314,6,314,9],[315,6,315,9],[316,6,316,9],[317,6,317,9],[318,6,318,9],[309,6,309,9],[310,6,310,9],[311,6,311,9],[312,6,312,9],[313,6,313,9],[324,6,324,9],[325,6,325,9],[326,6,326,9],[327,6,327,9],[328,6,328,9],[319,6,319,9],[320,6,320,9],[321,6,321,9],[322,6,322,9],[323,6,323,9],[334,6,334,9],[335,6,335,9],[336,6,336,9],[337,6,337,9],[338,6,338,9],[329,6,329,9],[330,6,330,9],[331,6,331,9],[332,6,332,9],[333,6,333,9],[344,6,344,9],[345,6,345,9],[346,6,346,9],[347,6,347,9],[348,6,348,9],[339,6,339,9],[340,6,340,9],[341,6,341,9],[342,6,342,9],[343,6,343,9],[354,6,354,9],[355,6,355,9],[356,6,356,9],[357,6,357,9],[358,6,358,9],[349,6,349,9],[350,6,350,9],[351,6,351,9],[352,6,352,9],[353,6,353,9],[364,6,364,9],[365,6,365,9],[366,6,366,9],[367,6,367,9],[368,6,368,9],[359,6,359,9],[360,6,360,9],[361,6,361,9],[362,6,362,9],[363,6,363,9],[379,6,379,9],[380,6,380,9],[374,6,374,9],[375,6,375,9],[376,6,376,9],[377,6,377,9],[378,6,378,9],[369,6,369,9],[370,6,370,9],[371,6,371,9],[372,6,372,9],[373,6,373,9]]}
[null,2018,"tt:mm/h",null,null,null,"Arbetsdagar","Arbetstid","Avtalsmässig arbetstid","Periodövertid"]
[null,null,true,null,null,"Januari",{"$f":"COUNTIFS(D$16:D$381,\">\"&0,B$16:B$381,\">=\"&DATE(StartÅr,1,1),B$16:B$381,\"<\"&DATE(StartÅr,2,1))\n+COUNTIFS(D$16:D$381,\"F\",B$16:B$381,\">=\"&DATE(StartÅr,1,1),B$16:B$381,\"<\"&DATE(StartÅr,2,1))\n+COUNTIFS(D$16:D$381,\"EN\",B$16:B$381,\">=\"&DATE(StartÅr,1,1),B$16:B$381,\"<\"&DATE(StartÅr,2,1))\n+COUNTIFS(D$16:D$381,\"0-dag\",B$16:B$381,\">=\"&DATE(StartÅr,1,1),B$16:B$381,\"<\"&DATE(StartÅr,2,1))\n+COUNTIFS(D$16:D$381,\"NK\",B$16:B$381,\">=\"&DATE(StartÅr,1,1),B$16:B$381,\"<\"&DATE(StartÅr,2,1))","v":0},{"$f":"TEXT(SUM(IF(TRUE,(1=MONTH(B$16:B$381))*(E$16:E$381),SUM(1*(E$16:E$381)))),IF(C$2,\"[t]:mm\",\"0,0#\"))","v":"0:00"},{"$f":"IF(C$2,TEXT(TEXT(Idealtid,\"0\\:00\")*G2,\"[t]:mm\"),TEXT(TEXT(Idealtid,\"0\\:00\")*G2*24,\"0,0#\"))","v":"0:00"},{"$f":"TEXT(IF(VALUE(H2)>VALUE(I2),H2-I2,I2-H2),IF($C$2,\"[t]:mm\",\"0,0#\"))","v":"0:00"}]
[null,null,null,null,null,"Februari",{"$f":"COUNTIFS(D$16:D$381,\">\"&0,B$16:B$381,\">=\"&DATE(StartÅr,2,1),B$16:B$381,\"<\"&DATE(StartÅr,3,1))\n+COUNTIFS(D$16:D$381,\"F\",B$16:B$381,\">=\"&DATE(StartÅr,2,1),B$16:B$381,\"<\"&DATE(StartÅr,3,1))\n+COUNTIFS(D$16:D$381,\"EN\",B$16:B$381,\">=\"&DATE(StartÅr,2,1),B$16:B$381,\"<\"&DATE(StartÅr,3,1))\n+COUNTIFS(D$16:D$381,\"0-dag\",B$16:B$381,\">=\"&DATE(StartÅr,2,1),B$16:B$381,\"<\"&DATE(StartÅr,3,1))\n+COUNTIFS(D$16:D$381,\"NK\",B$16:B$381,\">=\"&DATE(StartÅr,2,1),B$16:B$381,\"<\"&DATE(StartÅr,3,1))","v":0},{"$f":"TEXT(SUM(IF(TRUE,(2=MONTH(B$16:B$381))*(E$16:E$381),SUM(1*(E$16:E$381)))),IF(C$2,\"[t]:mm\",\"0,0#\"))","v":"0:00"},"0:00","0:00"]
[null,"Arbetstid per dag",null,null,null,"Mars",{"$f":"COUNTIFS(D$16:D$381,\">\"&0,B$16:B$381,\">=\"&DATE(StartÅr,3,1),B$16:B$381,\"<\"&DATE(StartÅr,4,1))\n+COUNTIFS(D$16:D$381,\"F\",B$16:B$381,\">=\"&DATE(StartÅr,3,1),B$16:B$381,\"<\"&DATE(StartÅr,4,1))\n+COUNTIFS(D$16:D$381,\"EN\",B$16:B$381,\">=\"&DATE(StartÅr,3,1),B$16:B$381,\"<\"&DATE(StartÅr,4,1))\n+COUNTIFS(D$16:D$381,\"0-dag\",B$16:B$381,\">=\"&DATE(StartÅr,3,1),B$16:B$381,\"<\"&DATE(StartÅr,4,1))\n+COUNTIFS(D$16:D$381,\"NK\",B$16:B$381,\">=\"&DATE(StartÅr,3,1),B$16:B$381,\"<\"&DATE(StartÅr,4,1))","v":0},{"$f":"TEXT(SUM(IF(TRUE,(3=MONTH(B$16:B$381))*(E$16:E$381),SUM(1*(E$16:E$381)))),IF(C$2,\"[t]:mm\",\"0,0#\"))","v":"0:00"},"0:00","0:00"]
[null,708,null,null,null,"April",{"$f":"COUNTIFS(D$16:D$381,\">\"&0,B$16:B$381,\">=\"&DATE(StartÅr,4,1),B$16:B$381,\"<\"&DATE(StartÅr,5,1))\n+COUNTIFS(D$16:D$381,\"F\",B$16:B$381,\">=\"&DATE(StartÅr,4,1),B$16:B$381,\"<\"&DATE(StartÅr,5,1))\n+COUNTIFS(D$16:D$381,\"EN\",B$16:B$381,\">=\"&DATE(StartÅr,4,1),B$16:B$381,\"<\"&DATE(StartÅr,5,1))\n+COUNTIFS(D$16:D$381,\"0-dag\",B$16:B$381,\">=\"&DATE(StartÅr,4,1),B$16:B$381,\"<\"&DATE(StartÅr,5,1))\n+COUNTIFS(D$16:D$381,\"NK\",B$16:B$381,\">=\"&DATE(StartÅr,4,1),B$16:B$381,\"<\"&DATE(StartÅr,5,1))","v":0},{"$f":"TEXT(SUM(IF(TRUE,(4=MONTH(B$16:B$381))*(E$16:E$381),SUM(1*(E$16:E$381)))),IF(C$2,\"[t]:mm\",\"0,0#\"))","v":"0:00"},"0:00","0:00"]
[null,null,null,null,null,"Maj",{"$f":"COUNTIFS(D$16:D$381,\">\"&0,B$16:B$381,\">=\"&DATE(StartÅr,5,1),B$16:B$381,\"<\"&DATE(StartÅr,6,1))\n+COUNTIFS(D$16:D$381,\"F\",B$16:B$381,\">=\"&DATE(StartÅr,5,1),B$16:B$381,\"<\"&DATE(StartÅr,6,1))\n+COUNTIFS(D$16:D$381,\"EN\",B$16:B$381,\">=\"&DATE(StartÅr,5,1),B$16:B$381,\"<\"&DATE(StartÅr,6,1))\n+COUNTIFS(D$16:D$381,\"0-dag\",B$16:B$381,\">=\"&DATE(StartÅr,5,1),B$16:B$381,\"<\"&DATE(StartÅr,6,1))\n+COUNTIFS(D$16:D$381,\"NK\",B$16:B$381,\">=\"&DATE(StartÅr,5,1),B$16:B$381,\"<\"&DATE(StartÅr,6,1))","v":0},{"$f":"TEXT(SUM(IF(TRUE,(5=MONTH(B$16:B$381))*(E$16:E$381),SUM(1*(E$16:E$381)))),IF(C$2,\"[t]:mm\",\"0,0#\"))","v":"0:00"},"0:00","0:00"]
[null,null,null,null,null,"Juni",{"$f":"COUNTIFS(D$16:D$381,\">\"&0,B$16:B$381,\">=\"&DATE(StartÅr,6,1),B$16:B$381,\"<\"&DATE(StartÅr,7,1))\n+COUNTIFS(D$16:D$381,\"F\",B$16:B$381,\">=\"&DATE(StartÅr,6,1),B$16:B$381,\"<\"&DATE(StartÅr,7,1))\n+COUNTIFS(D$16:D$381,\"EN\",B$16:B$381,\">=\"&DATE(StartÅr,6,1),B$16:B$381,\"<\"&DATE(StartÅr,7,1))\n+COUNTIFS(D$16:D$381,\"0-dag\",B$16:B$381,\">=\"&DATE(StartÅr,6,1),B$16:B$381,\"<\"&DATE(StartÅr,7,1))\n+COUNTIFS(D$16:D$381,\"NK\",B$16:B$381,\">=\"&DATE(StartÅr,6,1),B$16:B$381,\"<\"&DATE(StartÅr,7,1))","v":0},{"$f":"TEXT(SUM(IF(TRUE,(6=MONTH(B$16:B$381))*(E$16:E$381),SUM(1*(E$16:E$381)))),IF(C$2,\"[t]:mm\",\"0,0#\"))","v":"0:00"},"0:00","0:00"]
[null,null,null,null,null,"Juli",{"$f":"COUNTIFS(D$16:D$381,\">\"&0,B$16:B$381,\">=\"&DATE(StartÅr,7,1),B$16:B$381,\"<\"&DATE(StartÅr,8,1))\n+COUNTIFS(D$16:D$381,\"F\",B$16:B$381,\">=\"&DATE(StartÅr,7,1),B$16:B$381,\"<\"&DATE(StartÅr,8,1))\n+COUNTIFS(D$16:D$381,\"EN\",B$16:B$381,\">=\"&DATE(StartÅr,7,1),B$16:B$381,\"<\"&DATE(StartÅr,8,1))\n+COUNTIFS(D$16:D$381,\"0-dag\",B$16:B$381,\">=\"&DATE(StartÅr,7,1),B$16:B$381,\"<\"&DATE(StartÅr,8,1))\n+COUNTIFS(D$16:D$381,\"NK\",B$16:B$381,\">=\"&DATE(StartÅr,7,1),B$16:B$381,\"<\"&DATE(StartÅr,8,1))","v":0},{"$f":"TEXT(SUM(IF(TRUE,(7=MONTH(B$16:B$381))*(E$16:E$381),SUM(1*(E$16:E$381)))),IF(C$2,\"[t]:mm\",\"0,0#\"))","v":"0:00"},"0:00","0:00"]
[null,null,null,null,null,"Augusti",{"$f":"COUNTIFS(D$16:D$381,\">\"&0,B$16:B$381,\">=\"&DATE(StartÅr,8,1),B$16:B$381,\"<\"&DATE(StartÅr,9,1))\n+COUNTIFS(D$16:D$381,\"F\",B$16:B$381,\">=\"&DATE(StartÅr,8,1),B$16:B$381,\"<\"&DATE(StartÅr,9,1))\n+COUNTIFS(D$16:D$381,\"EN\",B$16:B$381,\">=\"&DATE(StartÅr,8,1),B$16:B$381,\"<\"&DATE(StartÅr,9,1))\n+COUNTIFS(D$16:D$381,\"0-dag\",B$16:B$381,\">=\"&DATE(StartÅr,8,1),B$16:B$381,\"<\"&DATE(StartÅr,9,1))\n+COUNTIFS(D$16:D$381,\"NK\",B$16:B$381,\">=\"&DATE(StartÅr,8,1),B$16:B$381,\"<\"&DATE(StartÅr,9,1))","v":0},{"$f":"TEXT(SUM(IF(TRUE,(8=MONTH(B$16:B$381))*(E$16:E$381),SUM(1*(E$16:E$381)))),IF(C$2,\"[t]:mm\",\"0,0#\"))","v":"0:00"},"0:00","0:00"]
[null,null,null,null,null,"September",{"$f":"COUNTIFS(D$16:D$381,\">\"&0,B$16:B$381,\">=\"&DATE(StartÅr,9,1),B$16:B$381,\"<\"&DATE(StartÅr,10,1))\n+COUNTIFS(D$16:D$381,\"F\",B$16:B$381,\">=\"&DATE(StartÅr,9,1),B$16:B$381,\"<\"&DATE(StartÅr,10,1))\n+COUNTIFS(D$16:D$381,\"EN\",B$16:B$381,\">=\"&DATE(StartÅr,9,1),B$16:B$381,\"<\"&DATE(StartÅr,10,1))\n+COUNTIFS(D$16:D$381,\"0-dag\",B$16:B$381,\">=\"&DATE(StartÅr,9,1),B$16:B$381,\"<\"&DATE(StartÅr,10,1))\n+COUNTIFS(D$16:D$381,\"NK\",B$16:B$381,\">=\"&DATE(StartÅr,9,1),B$16:B$381,\"<\"&DATE(StartÅr,10,1))","v":0},{"$f":"TEXT(SUM(IF(TRUE,(9=MONTH(B$16:B$381))*(E$16:E$381),SUM(1*(E$16:E$381)))),IF(C$2,\"[t]:mm\",\"0,0#\"))","v":"0:00"},"0:00","0:00"]
[null,null,null,null,null,"Oktober",{"$f":"COUNTIFS(D$16:D$381,\">\"&0,B$16:B$381,\">=\"&DATE(StartÅr,10,1),B$16:B$381,\"<\"&DATE(StartÅr,11,1))\n+COUNTIFS(D$16:D$381,\"F\",B$16:B$381,\">=\"&DATE(StartÅr,10,1),B$16:B$381,\"<\"&DATE(StartÅr,11,1))\n+COUNTIFS(D$16:D$381,\"EN\",B$16:B$381,\">=\"&DATE(StartÅr,10,1),B$16:B$381,\"<\"&DATE(StartÅr,11,1))\n+COUNTIFS(D$16:D$381,\"0-dag\",B$16:B$381,\">=\"&DATE(StartÅr,10,1),B$16:B$381,\"<\"&DATE(StartÅr,11,1))\n+COUNTIFS(D$16:D$381,\"NK\",B$16:B$381,\">=\"&DATE(StartÅr,10,1),B$16:B$381,\"<\"&DATE(StartÅr,11,1))","v":0},{"$f":"TEXT(SUM(IF(TRUE,(10=MONTH(B$16:B$381))*(E$16:E$381),SUM(1*(E$16:E$381)))),IF(C$2,\"[t]:mm\",\"0,0#\"))","v":"0:00"},"0:00","0:00"]
[null,null,null,null,null,"November",{"$f":"COUNTIFS(D$16:D$381,\">\"&0,B$16:B$381,\">=\"&DATE(StartÅr,11,1),B$16:B$381,\"<\"&DATE(StartÅr,12,1))\n+COUNTIFS(D$16:D$381,\"F\",B$16:B$381,\">=\"&DATE(StartÅr,11,1),B$16:B$381,\"<\"&DATE(StartÅr,12,1))\n+COUNTIFS(D$16:D$381,\"EN\",B$16:B$381,\">=\"&DATE(StartÅr,11,1),B$16:B$381,\"<\"&DATE(StartÅr,12,1))\n+COUNTIFS(D$16:D$381,\"0-dag\",B$16:B$381,\">=\"&DATE(StartÅr,11,1),B$16:B$381,\"<\"&DATE(StartÅr,12,1))\n+COUNTIFS(D$16:D$381,\"NK\",B$16:B$381,\">=\"&DATE(StartÅr,11,1),B$16:B$381,\"<\"&DATE(StartÅr,12,1))","v":0},{"$f":"TEXT(SUM(IF(TRUE,(11=MONTH(B$16:B$381))*(E$16:E$381),SUM(1*(E$16:E$381)))),IF(C$2,\"[t]:mm\",\"0,0#\"))","v":"0:00"},"0:00","0:00"]
[null,null,null,null,null,"December",{"$f":"COUNTIFS(D$16:D$381,\">\"&0,B$16:B$381,\">=\"&DATE(StartÅr,12,1),B$16:B$381,\"<=\"&DATE(StartÅr,12,31))\n+COUNTIFS(D$16:D$381,\"F\",B$16:B$381,\">=\"&DATE(StartÅr,12,1),B$16:B$381,\"<=\"&DATE(StartÅr,12,31))\n+COUNTIFS(D$16:D$381,\"EN\",B$16:B$381,\">=\"&DATE(StartÅr,12,1),B$16:B$381,\"<=\"&DATE(StartÅr,12,31))\n+COUNTIFS(D$16:D$381,\"0-dag\",B$16:B$381,\">=\"&DATE(StartÅr,12,1),B$16:B$381,\"<=\"&DATE(StartÅr,12,31))\n+COUNTIFS(D$16:D$381,\"NK\",B$16:B$381,\">=\"&DATE(StartÅr,12,1),B$16:B$381,\"<=\"&DATE(StartÅr,12,31))","v":0},{"$f":"TEXT(SUM(IF(TRUE,(12=MONTH(B$16:B$381))*(E$16:E$381),SUM(1*(E$16:E$381)))),IF(C$2,\"[t]:mm\",\"0,0#\"))","v":"0:00"},"0:00","0:00"]
[]
[null,null,null,"Arbetstid"]
[{"$f":"IF(OR(WEEKDAY(B16)=2,B16=DATE(YEAR(B16),MONTH(B16),1)),\"V. \"&WEEKNUM(B16,21),\"\")","v":"V. 1"},{"$f":"DATE(StartÅr,1,1)","v":"2018-01-01"},{"$f":"PROPER(TEXT(B16,\"dddd\"))","v":"Måndag"},null,{"$f":"IF(ISNUMBER(D16),IF($C$2,TEXT(TEXT(D16,\"00\\:00\"),\"[t]:mm\"),\n(TEXT(D16,\"00\\:00\"))*24),0)","v":0},{"$f":"IF(OR(ISNUMBER(D16),D16=\"F\",D16=\"EN\",D16=\"0-dag\",D16=\"FV\",D16=\"NK\"),TEXT(\nIF(OR(D16=\"F\",D16=\"EN\",D16=\"0-dag\",D16=\"NK\"),0,\nIF(D16=\"FV\",TEXT(Idealtid,\"00\\:00\"),\nIF(D16>Idealtid,(TEXT(D16,\"00\\:00\")-TEXT(Idealtid,\"00\\:00\")),(TEXT(Idealtid,\"00\\:00\")-TEXT(D16,\"00\\:00\")))))\n*IF($C$2,1,24),\nIF($C$2,\"[t]:mm\",\"0,0#\")),0)","v":0},{"$f":"IFERROR(VLOOKUP(B16,Helgdagar!A$2:C$24,3,FALSE),\"\")&\nIFERROR(VLOOKUP(B16,Helgdagar!E$2:G$24,3,FALSE),\"\")&\nIFERROR(VLOOKUP(B16,Helgdagar!I$2:K$24,3,FALSE),\"\")","v":"Nyårsdagen"}]
[{"$f":"IF(OR(WEEKDAY(B17)=2,B17=DATE(YEAR(B17),MONTH(B17),1)),\"V. \"&WEEKNUM(B17,21),\"\")","v":""},{"$f":"B16+1","v":"2018-01-02"},{"$f":"PROPER(TEXT(B17,\"dddd\"))","v":"Tisdag"},null,0,0,{"$f":"IFERROR(VLOOKUP(B17,Helgdagar!A$2:C$24,3,FALSE),\"\")&\nIFERROR(VLOOKUP(B17,Helgdagar!E$2:G$24,3,FALSE),\"\")&\nIFERROR(VLOOKUP(B17,Helgdagar!I$2:K$24,3,FALSE),\"\")","v":""}]
["",{"$f":"B17+1","v":"2018-01-03"},{"$f":"PROPER(TEXT(B18,\"dddd\"))","v":"Onsdag"},null,0,0,{"$f":"IFERROR(VLOOKUP(B18,Helgdagar!A$2:C$24,3,FALSE),\"\")&\nIFERROR(VLOOKUP(B18,Helgdagar!E$2:G$24,3,FALSE),\"\")&\nIFERROR(VLOOKUP(B18,Helgdagar!I$2:K$24,3,FALSE),\"\")","v":""}]
["","2018-01-04","Torsdag",null,0,0,{"$f":"IFERROR(VLOOKUP(B19,Helgdagar!A$2:C$24,3,FALSE),\"\")&\nIFERROR(VLOOKUP(B19,Helgdagar!E$2:G$24,3,FALSE),\"\")&\nIFERROR(VLOOKUP(B19,Helgdagar!I$2:K$24,3,FALSE),\"\")","v":""}]
["","2018-01-05","Fredag",null,0,0,{"$f":"IFERROR(VLOOKUP(B20,Helgdagar!A$2:C$24,3,FALSE),\"\")&\nIFERROR(VLOOKUP(B20,Helgdagar!E$2:G$24,3,FALSE),\"\")&\nIFERROR(VLOOKUP(B20,Helgdagar!I$2:K$24,3,FALSE),\"\")","v":""}]
{"$rows_left_out":362}
{"sheet":"Instruktion","index":1,"n_rows":0,"n_cols":0,"rows_kept":0,"cut":false,"hidden":true,"merged":[]}

{"sheet":"Makroaktivering","index":2,"n_rows":0,"n_cols":0,"rows_kept":0,"cut":false,"hidden":false,"merged":[]}

{"sheet":"Helgdagar","index":3,"n_rows":35,"n_cols":18,"rows_kept":35,"cut":false,"hidden":true,"merged":[[0,0,0,2],[0,4,0,6],[0,8,0,10],[14,12,21,14]]}
["Fredagslistor",null,null,null,"Lördagslistor",null,null,null,"Söndagslistor",null,null,null,{"$f":"DATE(StartÅr,1,1)","v":"2018-01-01"},{"$f":"IF(ISNUMBER(M1),TEXT(M1,\"dddd\"),\"\")","v":"måndag"},"Nyårsdagen"]
[null,null,null,null,{"$f":"IF(OR(WEEKDAY(DATE(StartÅr,1,1))=6,WEEKDAY(DATE(StartÅr,1,1))=7),DATE(StartÅr,1,1),\"\")","v":""},{"$f":"IF(ISNUMBER(E2),TEXT(E2,\"dddd\"),\"\")","v":""},{"$f":"IF(ISNUMBER(E2),\"Nyårsdagen\",\"\")","v":""},null,{"$f":"IF(OR(WEEKDAY(DATE(StartÅr,1,1))=1,WEEKDAY(DATE(StartÅr,1,1))=2,WEEKDAY(DATE(StartÅr,1,1))=3,WEEKDAY(DATE(StartÅr,1,1))=4,WEEKDAY(DATE(StartÅr,1,1))=5),DATE(StartÅr,1,1),\"\")","v":"2018-01-01"},{"$f":"IF(ISNUMBER(I2),TEXT(I2,\"dddd\"),\"\")","v":"måndag"},{"$f":"IF(ISNUMBER(I2),\"Nyårsdagen\",\"\")","v":"Nyårsdagen"},null,{"$f":"DATE(StartÅr,1,6)","v":"2018-01-06"},{"$f":"IF(ISNUMBER(M2),TEXT(M2,\"dddd\"),\"\")","v":"lördag"},"Trettondedag jul"]
[{"$f":"IF(OR(WEEKDAY(DATE(StartÅr,1,6))=3,WEEKDAY(DATE(StartÅr,1,6))=4,WEEKDAY(DATE(StartÅr,1,6))=5,WEEKDAY(DATE(StartÅr,1,6))=6,WEEKDAY(DATE(StartÅr,1,6))=7),DATE(StartÅr,1,5),\"\")","v":"2018-01-05"},{"$f":"IF(ISNUMBER(A3),TEXT(A3,\"dddd\"),\"\")","v":"fredag"},null,null,{"$f":"IF(WEEKDAY(DATE(StartÅr,1,5))=1,DATE(StartÅr,1,5),\"\")","v":""},{"$f":"IF(ISNUMBER(E3),TEXT(E3,\"dddd\"),\"\")","v":""},null,null,null,null,null,null,{"$f":"M4-2","v":"2018-03-30"},"fredag","Långfredagen",null,null,"ELLER(VECKODAG($A14)=1;ICKE(ÄRSAKNAD(LETARAD($A14;Blad2!A1:A13;1;FALSKT))))"]
[null,null,null,null,{"$f":"IF(OR(WEEKDAY(DATE(StartÅr,1,6))=6,WEEKDAY(DATE(StartÅr,1,6))=7),DATE(StartÅr,1,6),\"\")","v":"2018-01-06"},{"$f":"IF(ISNUMBER(E4),TEXT(E4,\"dddd\"),\"\")","v":"lördag"},{"$f":"IF(ISNUMBER(E4),\"Trettondedag jul\",\"\")","v":"Trettondedag jul"},null,{"$f":"IF(OR(WEEKDAY(DATE(StartÅr,1,6))=1,WEEKDAY(DATE(StartÅr,1,6))=2,WEEKDAY(DATE(StartÅr,1,6))=3,WEEKDAY(DATE(StartÅr,1,6))=4,WEEKDAY(DATE(StartÅr,1,6))=5),DATE(StartÅr,1,6),\"\")","v":""},{"$f":"IF(ISNUMBER(I4),TEXT(I4,\"dddd\"),\"\")","v":""},{"$f":"IF(ISNUMBER(I4),\"Trettondedag jul\",\"\")","v":""},null,{"$f":"M5-1","v":"2018-04-01"},"söndag","Påskdagen"]
[{"$f":"I9-4","v":"2018-03-29"},{"$f":"IF(ISNUMBER(A5),TEXT(A5,\"dddd\"),\"\")","v":"torsdag"},"Skärtorsdagen",null,null,null,null,null,null,null,null,null,{"$f":"FLOOR(StartÅr&\"-05-\"&DAY(MINUTE(StartÅr/38)/2+56),7)-33","v":"2018-04-02"},"måndag","Annandag påsk"]
[null,null,null,null,{"$f":"I9-3","v":"2018-03-30"},{"$f":"IF(ISNUMBER(E6),TEXT(E6,\"dddd\"),\"\")","v":"fredag"},"Långfredagen",null,null,null,null,null,{"$f":"DATE(StartÅr,5,1)","v":"2018-05-01"},"tisdag","Första maj"]
[null,null,null,null,{"$f":"I9-2","v":"2018-03-31"},{"$f":"IF(ISNUMBER(E7),TEXT(E7,\"dddd\"),\"\")","v":"lördag"},"Påskafton",null,null,null,null,null,{"$f":"FLOOR(StartÅr&\"-05-\"&DAY(MINUTE(StartÅr/38)/2+56),7)-34+39","v":"2018-05-10"},"torsdag","Kristi himmelfärdsdagen"]
[null,null,null,null,{"$f":"I9-1","v":"2018-04-01"},{"$f":"IF(ISNUMBER(E8),TEXT(E8,\"dddd\"),\"\")","v":"söndag"},"Påskdagen",null,null,null,null,null,{"$f":"FLOOR(StartÅr&\"-05-\"&DAY(MINUTE(StartÅr/38)/2+56),7)+15","v":"2018-05-20"},"söndag","Pingstdagen"]
[null,null,null,null,null,null,null,null,{"$f":"FLOOR(StartÅr&\"-05-\"&DAY(MINUTE(StartÅr/38)/2+56),7)-33","v":"2018-04-02"},{"$f":"IF(ISNUMBER(I9),TEXT(I9,\"dddd\"),\"\")","v":"måndag"},"Annandag påsk",null,{"$f":"DATE(StartÅr,6,6)","v":"2018-06-06"},"onsdag","Sveriges nationaldag"]
[{"$f":"IF(NOT(OR(ISNUMBER(E10),ISNUMBER(I10))),DATE(StartÅr,4,30),\"\")","v":"2018-04-30"},{"$f":"IF(ISNUMBER(A10),TEXT(A10,\"dddd\"),\"\")","v":"måndag"},{"$f":"IF(ISNUMBER(A10),\"Valborgsmässafton\",\"\")","v":"Valborgsmässafton"},null,{"$f":"IF(OR(WEEKDAY(DATE(StartÅr,4,30))=1,WEEKDAY(DATE(StartÅr,4,30))=7),DATE(StartÅr,4,30),\"\")","v":""},{"$f":"IF(ISNUMBER(E10),TEXT(E10,\"dddd\"),\"\")","v":""},{"$f":"IF(ISNUMBER(E10),\"Valborgsmässafton\",\"\")","v":""},null,null,null,null,null,{"$f":"DATE(StartÅr,6,1)+IF(2<WEEKDAY(DATE(StartÅr,6,1)),7-WEEKDAY(DATE(StartÅr,6,1))+2,2-WEEKDAY(DATE(StartÅr,6,1)))+((3-1)*7)+4+1","v":"2018-06-23"},"lördag","Midsommardagen"]
[null,null,null,null,{"$f":"IF(OR(WEEKDAY(DATE(StartÅr,5,1))=6,WEEKDAY(DATE(StartÅr,5,1))=7),DATE(StartÅr,5,1),\"\")","v":""},{"$f":"IF(ISNUMBER(E11),TEXT(E11,\"dddd\"),\"\")","v":""},{"$f":"IF(ISNUMBER(E11),\"Första maj\",\"\")","v":""},null,{"$f":"IF(OR(WEEKDAY(DATE(StartÅr,5,1))=1,WEEKDAY(DATE(StartÅr,5,1))=2,WEEKDAY(DATE(StartÅr,5,1))=3,WEEKDAY(DATE(StartÅr,5,1))=4,WEEKDAY(DATE(StartÅr,5,1))=5),DATE(StartÅr,5,1),\"\")","v":"2018-05-01"},{"$f":"IF(ISNUMBER(I11),TEXT(I11,\"dddd\"),\"\")","v":"tisdag"},{"$f":"IF(ISNUMBER(I11),\"Första maj\",\"\")","v":"Första maj"},null,{"$f":"IF(WEEKDAY(DATE(StartÅr,10,31))=7,DATE(StartÅr,10,31),\nIF(WEEKDAY(DATE(StartÅr,11,1))=7,DATE(StartÅr,11,1),\nIF(WEEKDAY(DATE(StartÅr,11,2))=7,DATE(StartÅr,11,2),\nIF(WEEKDAY(DATE(StartÅr,11,3))=7,DATE(StartÅr,11,3),\nIF(WEEKDAY(DATE(StartÅr,11,4))=7,DATE(StartÅr,11,4),\nIF(WEEKDAY(DATE(StartÅr,11,5))=7,DATE(StartÅr,11,5),\nDATE(StartÅr,11,6)\n))))))","v":"2018-11-03"},"lördag","Alla helgons dag"]
[{"$f":"I12-1","v":"2018-05-09"},{"$f":"IF(ISNUMBER(A12),TEXT(A12,\"dddd\"),\"\")","v":"onsdag"},null,null,null,null,null,null,{"$f":"FLOOR(StartÅr&\"-05-\"&DAY(MINUTE(StartÅr/38)/2+56),7)-34+39","v":"2018-05-10"},{"$f":"IF(ISNUMBER(I12),TEXT(I12,\"dddd\"),\"\")","v":"torsdag"},"Kristi himmelfärdsdagen",null,{"$f":"DATE(StartÅr,12,25)","v":"2018-12-25"},"tisdag","Juldagen"]
[null,null,null,null,{"$f":"FLOOR(StartÅr&\"-05-\"&DAY(MINUTE(StartÅr/38)/2+56),7)+14","v":"2018-05-19"},{"$f":"IF(ISNUMBER(E13),TEXT(E13,\"dddd\"),\"\")","v":"lördag"},"Pingstafton",null,{"$f":"FLOOR(StartÅr&\"-05-\"&DAY(MINUTE(StartÅr/38)/2+56),7)+15","v":"2018-05-20"},{"$f":"IF(ISNUMBER(I13),TEXT(I13,\"dddd\"),\"\")","v":"söndag"},"Pingstdagen",null,{"$f":"DATE(StartÅr,12,26)","v":"2018-12-26"},"onsdag","Annandag jul"]
[{"$f":"IF(OR(WEEKDAY(DATE(StartÅr,6,6))=3,WEEKDAY(DATE(StartÅr,6,6))=4,WEEKDAY(DATE(StartÅr,6,6))=5,WEEKDAY(DATE(StartÅr,6,6))=6,WEEKDAY(DATE(StartÅr,6,6))=7),DATE(StartÅr,6,5),\"\")","v":"2018-06-05"},{"$f":"IF(ISNUMBER(A14),TEXT(A14,\"dddd\"),\"\")","v":"tisdag"},null,null,{"$f":"IF(WEEKDAY(DATE(StartÅr,6,5))=1,DATE(StartÅr,6,5),\"\")","v":""},""]
[null,null,null,null,{"$f":"IF(OR(WEEKDAY(DATE(StartÅr,6,6))=6,WEEKDAY(DATE(StartÅr,6,6))=7),DATE(StartÅr,6,6),\"\")","v":""},"",{"$f":"IF(ISNUMBER(E15),\"Sveriges nationaldag\",\"\")","v":""},null,{"$f":"IF(OR(WEEKDAY(DATE(StartÅr,6,6))=1,WEEKDAY(DATE(StartÅr,6,6))=2,WEEKDAY(DATE(StartÅr,6,6))=3,WEEKDAY(DATE(StartÅr,6,6))=4,WEEKDAY(DATE(StartÅr,6,6))=5),DATE(StartÅr,6,6),\"\")","v":"2018-06-06"},{"$f":"IF(ISNUMBER(I15),TEXT(I15,\"dddd\"),\"\")","v":"onsdag"},{"$f":"IF(ISNUMBER(I15),\"Sveriges nationaldag\",\"\")","v":"Sveriges nationaldag"},null,"Om någon helgdag infaller på samma dag som annan helgdag, kommer inte båda helgdagarna visas med namn i fridagsgrupper. Vid sådan händelse som exempelvis 2008, kommer kommer dessa dubbla dagar markeras i en färg med villkorsstyrd formatering här ovan. 2008 kommer enbart 1 maj synas i Fridagsgrupper."]
[{"$f":"E16-1","v":"2018-06-21"},{"$f":"IF(ISNUMBER(A16),TEXT(A16,\"dddd\"),\"\")","v":"torsdag"},null,null,{"$f":"DATE(StartÅr,6,1)+IF(2<WEEKDAY(DATE(StartÅr,6,1)),7-WEEKDAY(DATE(StartÅr,6,1))+2,2-WEEKDAY(DATE(StartÅr,6,1)))+((3-1)*7)+4","v":"2018-06-22"},"fredag","Midsommarafton"]
[null,null,null,null,{"$f":"E16+1","v":"2018-06-23"},{"$f":"IF(ISNUMBER(E17),TEXT(E17,\"dddd\"),\"\")","v":"lördag"},"Midsommardagen"]
[null,null,null,null,{"$f":"IF(WEEKDAY(DATE(StartÅr,10,31))=7,DATE(StartÅr,10,31),\nIF(WEEKDAY(DATE(StartÅr,11,1))=7,DATE(StartÅr,11,1),\nIF(WEEKDAY(DATE(StartÅr,11,2))=7,DATE(StartÅr,11,2),\nIF(WEEKDAY(DATE(StartÅr,11,3))=7,DATE(StartÅr,11,3),\nIF(WEEKDAY(DATE(StartÅr,11,4))=7,DATE(StartÅr,11,4),\nIF(WEEKDAY(DATE(StartÅr,11,5))=7,DATE(StartÅr,11,5),\nDATE(StartÅr,11,6)\n))))))","v":"2018-11-03"},"lördag","Alla helgons dag"]
[{"$f":"IF(OR(WEEKDAY(E20)=3,WEEKDAY(E20)=4,WEEKDAY(E20)=5,WEEKDAY(E20)=6,WEEKDAY(E20)=7),E20-1,\"\")","v":""},{"$f":"IF(ISNUMBER(A19),TEXT(A19,\"dddd\"),\"\")","v":""},null,null,{"$f":"IF(WEEKDAY(DATE(StartÅr,12,23))=1,DATE(StartÅr,12,23),\"\")","v":"2018-12-23"},"söndag"]
[null,null,null,null,{"$f":"DATE(StartÅr,12,24)","v":"2018-12-24"},"måndag","Julafton"]
{"$rows_left_out":15}