{"text_format":"1","workbook":"xlsx","n_sheets":4,"sheets":["Periodövertid","Instruktion","Makroaktivering","Helgdagar"],"not_rendered":{"charts":0,"images":4,"macros":1,"external_links":5,"defined_names":43,"comments":0,"pivot_tables":0},"unopened":[],"bounds":{"document_bytes":16777216,"sheet_cells":100000,"rows_first":2000,"rows_last":500,"rows_between":2000,"halvings":0,"cell_chars":16384,"cell_head_chars":4096},"cells_cut":0,"cells_raw":0,"read":"whole","date_system":"1900"}

{"sheet":"Periodövertid","index":0,"n_rows":381,"n_cols":10,"rows_kept":381,"cut":false,"hidden":true,"merged":[[0,1,1,1],[15,6,15,9],[16,6,16,9],[17,6,17,9],[18,6,18,9],[24,6,24,9],[25,6,25,9],[26,6,26,9],[27,6,27,9],[28,6,28,9],[19,6,19,9],[20,6,20,9],[21,6,21,9],[22,6,22,9],[23,6,23,9],[34,6,34,9],[35,6,35,9],[36,6,36,9],[37,6,37,9],[38,6,38,9],[29,6,29,9],[30,6,30,9],[31,6,31,9],[32,6,32,9],[33,6,33,9],[44,6,44,9],[45,6,45,9],[46,6,46,9],[47,6,47,9],[48,6,48,9],[39,6,39,9],[40,6,40,9],[41,6,41,9],[42,6,42,9],[43,6,43,9],[54,6,54,9],[55,6,55,9],[56,6,56,9],[57,6,57,9],[58,6,58,9],[49,6,49,9],[50,6,50,9],[51,6,51,9],[52,6,52,9],[53,6,53,9],[64,6,64,9],[65,6,65,9],[66,6,66,9],[67,6,67,9],[68,6,68,9],[59,6,59,9],[60,6,60,9],[61,6,61,9],[62,6,62,9],[63,6,63,9],[74,6,74,9],[75,6,75,9],[76,6,76,9],[77,6,77,9],[78,6,78,9],[69,6,69,9],[70,6,70,9],[71,6,71,9],[72,6,72,9],[73,6,73,9],[84,6,84,9],[85,6,85,9],[86,6,86,9],[87,6,87,9],[88,6,88,9],[79,6,79,9],[80,6,80,9],[81,6,81,9],[82,6,82,9],[83,6,83,9],[94,6,94,9],[95,6,95,9],[96,6,96,9],[97,6,97,9],[98,6,98,9],[89,6,89,9],[90,6,90,9],[91,6,91,9],[92,6,92,9],[93,6,93,9],[104,6,104,9],[105,6,105,9],[106,6,106,9],[107,6,107,9],[108,6,108,9],[99,6,99,9],[100,6,100,9],[101,6,101,9],[102,6,102,9],[103,6,103,9],[114,6,114,9],[115,6,115,9],[116,6,116,9],[117,6,117,9],[118,6,118,9],[109,6,109,9],[110,6,110,9],[111,6,111,9],[112,6,112,9],[113,6,113,9],[124,6,124,9],[125,6,125,9],[126,6,126,9],[127,6,127,9],[128,6,128,9],[119,6,119,9],[120,6,120,9],[121,6,121,9],[122,6,122,9],[123,6,123,9],[134,6,134,9],[135,6,135,9],[136,6,136,9],[137,6,137,9],[138,6,138,9],[129,6,129,9],[130,6,130,9],[131,6,131,9],[132,6,132,9],[133,6,133,9],[144,6,144,9],[145,6,145,9],[146,6,146,9],[147,6,147,9],[148,6,148,9],[139,6,139,9],[140,6,140,9],[141,6,141,9],[142,6,142,9],[143,6,143,9],[154,6,154,9],[155,6,155,9],[156,6,156,9],[157,6,157,9],[158,6,158,9],[149,6,149,9],[150,6,150,9],[151,6,151,9],[152,6,152,9],[153,6,153,9],[164,6,164,9],[165,6,165,9],[166,6,166,9],[167,6,167,9],[168,6,168,9],[159,6,159,9],[160,6,160,9],[161,6,161,9],[162,6,162,9],[163,6,163,9],[174,6,174,9],[175,6,175,9],[176,6,176,9],[177,6,177,9],[178,6,178,9],[169,6,169,9],[170,6,170,9],[171,6,171,9],[172,6,172,9],[173,6,173,9],[184,6,184,9],[185,6,185,9],[186,6,186,9],[187,6,187,9],[188,6,188,9],[179,6,179,9],[180,6,180,9],[181,6,181,9],[182,6,182,9],[183,6,183,9],[194,6,194,9],[195,6,195,9],[196,6,196,9],[197,6,197,9],[198,6,198,9],[189,6,189,9],[190,6,190,9],[191,6,191,9],[192,6,192,9],[193,6,193,9],[204,6,204,9],[205,6,205,9],[206,6,206,9],[207,6,207,9],[208,6,208,9],[199,6,199,9],[200,6,200,9],[201,6,201,9],[202,6,202,9],[203,6,203,9],[214,6,214,9],[215,6,215,9],[216,6,216,9],[217,6,217,9],[218,6,218,9],[209,6,209,9],[210,6,210,9],[211,6,211,9],[212,6,212,9],[213,6,213,9],[224,6,224,9],[225,6,225,9],[226,6,226,9],[227,6,227,9],[228,6,228,9],[219,6,219,9],[220,6,220,9],[221,6,221,9],[222,6,222,9],[223,6,223,9],[234,6,234,9],[235,6,235,9],[236,6,236,9],[237,6,237,9],[238,6,238,9],[229,6,229,9],[230,6,230,9],[231,6,231,9],[232,6,232,9],[233,6,233,9],[244,6,244,9],[245,6,245,9],[246,6,246,9],[247,6,247,9],[248,6,248,9],[239,6,239,9],[240,6,240,9],[241,6,241,9],[242,6,242,9],[243,6,243,9],[254,6,254,9],[255,6,255,9],[256,6,256,9],[257,6,257,9],[258,6,258,9],[249,6,249,9],[250,6,250,9],[251,6,251,9],[252,6,252,9],[253,6,253,9],[264,6,264,9],[265,6,265,9],[266,6,266,9],[267,6,267,9],[268,6,268,9],[259,6,259,9],[260,6,260,9],[261,6,261,9],[262,6,262,9],[263,6,263,9],[274,6,274,9],[275,6,275,9],[276,6,276,9],[277,6,277,9],[278,6,278,9],[269,6,269,9],[270,6,270,9],[271,6,271,9],[272,6,272,9],[273,6,273,9],[284,6,284,9],[285,6,285,9],[286,6,286,9],[287,6,287,9],[288,6,288,9],[279,6,279,9],[280,6,280,9],[281,6,281,9],[282,6,282,9],[283,6,283,9],[294,6,294,9],[295,6,295,9],[296,6,296,9],[297,6,297,9],[298,6,298,9],[289,6,289,9],[290,6,290,9],[291,6,291,9],[292,6,292,9],[293,6,293,9],[304,6,304,9],[305,6,305,9],[306,6,306,9],[307,6,307,9],[308,6,308,9],[299,6,299,9],[300,6,300,9],[301,6,301,9],[302,6,302,9],[303,6,303,9],[314,6,314,9],[315,6,315,9],[316,6,316,9],[317,6,317,9],[318,6,318,9],[309,6,309,9],[310,6,310,9],[311,6,311,9],[312,6,312,9],[313,6,313,9],[324,6,324,9],[325,6,325,9],[326,6,326,9],[327,6,327,9],[328,6,328,9],[319,6,319,9],[320,6,320,9],[321,6,321,9],[322,6,322,9],[323,6,323,9],[334,6,334,9],[335,6,335,9],[336,6,336,9],[337,6,337,9],[338,6,338,9],[329,6,329,9],[330,6,330,9],[331,6,331,9],[332,6,332,9],[333,6,333,9],[344,6,344,9],[345,6,345,9],[346,6,346,9],[347,6,347,9],[348,6,348,9],[339,6,339,9],[340,6,340,9],[341,6,341,9],[342,6,342,9],[343,6,343,9],[354,6,354,9],[355,6,355,9],[356,6,356,9],[357,6,357,9],[358,6,358,9],[349,6,349,9],[350,6,350,9],[351,6,351,9],[352,6,352,9],[353,6,353,9],[364,6,364,9],[365,6,365,9],[366,6,366,9],[367,6,367,9],[368,6,368,9],[359,6,359,9],[360,6,360,9],[361,6,361,9],[362,6,362,9],[363,6,363,9],[379,6,379,9],[380,6,380,9],[374,6,374,9],[375,6,375,9],[376,6,376,9],[377,6,377,9],[378,6,378,9],[369,6,369,9],[370,6,370,9],[371,6,371,9],[372,6,372,9],[373,6,373,9]]}
[null,2018,"tt:mm/h",null,null,null,"Arbetsdagar","Arbetstid","Avtalsmässig arbetstid","Periodövertid"]
[null,null,true,null,null,"Januari",{"$f":"COUNTIFS(D$16:D$381,\">\"&0,B$16:B$381,\">=\"&DATE(StartÅr,1,1),B$16:B$381,\"<\"&DATE(StartÅr,2,1))\n+COUNTIFS(D$16:D$381,\"F\",B$16:B$381,\">=\"&DATE(StartÅr,1,1),B$16:B$381,\"<\"&DATE(StartÅr,2,1))\n+COUNTIFS(D$16:D$381,\"EN\",B$16:B$381,\">=\"&DATE(StartÅr,1,1),B$16:B$381,\"<\"&DATE(StartÅr,2,1))\n+COUNTIFS(D$16:D$381,\"0-dag\",B$16:B$381,\">=\"&DATE(StartÅr,1,1),B$16:B$381,\"<\"&DATE(StartÅr,2,1))\n+COUNTIFS(D$16:D$381,\"NK\",B$16:B$381,\">=\"&DATE(StartÅr,1,1),B$16:B$381,\"<\"&DATE(StartÅr,2,1))","v":0},{"$f":"TEXT(SUM(IF(TRUE,(1=MONTH(B$16:B$381))*(E$16:E$381),SUM(1*(E$16:E$381)))),IF(C$2,\"[t]:mm\",\"0,0#\"))","v":"0:00"},{"$f":"IF(C$2,TEXT(TEXT(Idealtid,\"0\\:00\")*G2,\"[t]:mm\"),TEXT(TEXT(Idealtid,\"0\\:00\")*G2*24,\"0,0#\"))","v":"0:00"},{"$f":"TEXT(IF(VALUE(H2)>VALUE(I2),H2-I2,I2-H2),IF($C$2,\"[t]:mm\",\"0,0#\"))","v":"0:00"}]
[null,null,null,null,null,"Februari",{"$f":"COUNTIFS(D$16:D$381,\">\"&0,B$16:B$381,\">=\"&DATE(StartÅr,2,1),B$16:B$381,\"<\"&DATE(StartÅr,3,1))\n+COUNTIFS(D$16:D$381,\"F\",B$16:B$381,\">=\"&DATE(StartÅr,2,1),B$16:B$381,\"<\"&DATE(StartÅr,3,1))\n+COUNTIFS(D$16:D$381,\"EN\",B$16:B$381,\">=\"&DATE(StartÅr,2,1),B$16:B$381,\"<\"&DATE(StartÅr,3,1))\n+COUNTIFS(D$16:D$381,\"0-dag\",B$16:B$381,\">=\"&DATE(StartÅr,2,1),B$16:B$381,\"<\"&DATE(StartÅr,3,1))\n+COUNTIFS(D$16:D$381,\"NK\",B$16:B$381,\">=\"&DATE(StartÅr,2,1),B$16:B$381,\"<\"&DATE(StartÅr,3,1))","v":0},{"$f":"TEXT(SUM(IF(TRUE,(2=MONTH(B$16:B$381))*(E$16:E$381),SUM(1*(E$16:E$381)))),IF(C$2,\"[t]:mm\",\"0,0#\"))","v":"0:00"},"0:00","0:00"]
[null,"Arbetstid per dag",null,null,null,"Mars",{"$f":"COUNTIFS(D$16:D$381,\">\"&0,B$16:B$381,\">=\"&DATE(StartÅr,3,1),B$16:B$381,\"<\"&DATE(StartÅr,4,1))\n+COUNTIFS(D$16:D$381,\"F\",B$16:B$381,\">=\"&DATE(StartÅr,3,1),B$16:B$381,\"<\"&DATE(StartÅr,4,1))\n+COUNTIFS(D$16:D$381,\"EN\",B$16:B$381,\">=\"&DATE(StartÅr,3,1),B$16:B$381,\"<\"&DATE(StartÅr,4,1))\n+COUNTIFS(D$16:D$381,\"0-dag\",B$16:B$381,\">=\"&DATE(StartÅr,3,1),B$16:B$381,\"<\"&DATE(StartÅr,4,1))\n+COUNTIFS(D$16:D$381,\"NK\",B$16:B$381,\">=\"&DATE(StartÅr,3,1),B$16:B$381,\"<\"&DATE(StartÅr,4,1))","v":0},{"$f":"TEXT(SUM(IF(TRUE,(3=MONTH(B$16:B$381))*(E$16:E$381),SUM(1*(E$16:E$381)))),IF(C$2,\"[t]:mm\",\"0,0#\"))","v":"0:00"},"0:00","0:00"]
[null,708,null,null,null,"April",{"$f":"COUNTIFS(D$16:D$381,\">\"&0,B$16:B$381,\">=\"&DATE(StartÅr,4,1),B$16:B$381,\"<\"&DATE(StartÅr,5,1))\n+COUNTIFS(D$16:D$381,\"F\",B$16:B$381,\">=\"&DATE(StartÅr,4,1),B$16:B$381,\"<\"&DATE(StartÅr,5,1))\n+COUNTIFS(D$16:D$381,\"EN\",B$16:B$381,\">=\"&DATE(StartÅr,4,1),B$16:B$381,\"<\"&DATE(StartÅr,5,1))\n+COUNTIFS(D$16:D$381,\"0-dag\",B$16:B$381,\">=\"&DATE(StartÅr,4,1),B$16:B$381,\"<\"&DATE(StartÅr,5,1))\n+COUNTIFS(D$16:D$381,\"NK\",B$16:B$381,\">=\"&DATE(StartÅr,4,1),B$16:B$381,\"<\"&DATE(StartÅr,5,1))","v":0},{"$f":"TEXT(SUM(IF(TRUE,(4=MONTH(B$16:B$381))*(E$16:E$381),SUM(1*(E$16:E$381)))),IF(C$2,\"[t]:mm\",\"0,0#\"))","v":"0:00"},"0:00","0:00"]
[null,null,null,null,null,"Maj",{"$f":"COUNTIFS(D$16:D$381,\">\"&0,B$16:B$381,\">=\"&DATE(StartÅr,5,1),B$16:B$381,\"<\"&DATE(StartÅr,6,1))\n+COUNTIFS(D$16:D$381,\"F\",B$16:B$381,\">=\"&DATE(StartÅr,5,1),B$16:B$381,\"<\"&DATE(StartÅr,6,1))\n+COUNTIFS(D$16:D$381,\"EN\",B$16:B$381,\">=\"&DATE(StartÅr,5,1),B$16:B$381,\"<\"&DATE(StartÅr,6,1))\n+COUNTIFS(D$16:D$381,\"0-dag\",B$16:B$381,\">=\"&DATE(StartÅr,5,1),B$16:B$381,\"<\"&DATE(StartÅr,6,1))\n+COUNTIFS(D$16:D$381,\"NK\",B$16:B$381,\">=\"&DATE(StartÅr,5,1),B$16:B$381,\"<\"&DATE(StartÅr,6,1))","v":0},{"$f":"TEXT(SUM(IF(TRUE,(5=MONTH(B$16:B$381))*(E$16:E$381),SUM(1*(E$16:E$381)))),IF(C$2,\"[t]:mm\",\"0,0#\"))","v":"0:00"},"0:00","0:00"]
[null,null,null,null,null,"Juni",{"$f":"COUNTIFS(D$16:D$381,\">\"&0,B$16:B$381,\">=\"&DATE(StartÅr,6,1),B$16:B$381,\"<\"&DATE(StartÅr,7,1))\n+COUNTIFS(D$16:D$381,\"F\",B$16:B$381,\">=\"&DATE(StartÅr,6,1),B$16:B$381,\"<\"&DATE(StartÅr,7,1))\n+COUNTIFS(D$16:D$381,\"EN\",B$16:B$381,\">=\"&DATE(StartÅr,6,1),B$16:B$381,\"<\"&DATE(StartÅr,7,1))\n+COUNTIFS(D$16:D$381,\"0-dag\",B$16:B$381,\">=\"&DATE(StartÅr,6,1),B$16:B$381,\"<\"&DATE(StartÅr,7,1))\n+COUNTIFS(D$16:D$381,\"NK\",B$16:B$381,\">=\"&DATE(StartÅr,6,1),B$16:B$381,\"<\"&DATE(StartÅr,7,1))","v":0},{"$f":"TEXT(SUM(IF(TRUE,(6=MONTH(B$16:B$381))*(E$16:E$381),SUM(1*(E$16:E$381)))),IF(C$2,\"[t]:mm\",\"0,0#\"))","v":"0:00"},"0:00","0:00"]
[null,null,null,null,null,"Juli",{"$f":"COUNTIFS(D$16:D$381,\">\"&0,B$16:B$381,\">=\"&DATE(StartÅr,7,1),B$16:B$381,\"<\"&DATE(StartÅr,8,1))\n+COUNTIFS(D$16:D$381,\"F\",B$16:B$381,\">=\"&DATE(StartÅr,7,1),B$16:B$381,\"<\"&DATE(StartÅr,8,1))\n+COUNTIFS(D$16:D$381,\"EN\",B$16:B$381,\">=\"&DATE(StartÅr,7,1),B$16:B$381,\"<\"&DATE(StartÅr,8,1))\n+COUNTIFS(D$16:D$381,\"0-dag\",B$16:B$381,\">=\"&DATE(StartÅr,7,1),B$16:B$381,\"<\"&DATE(StartÅr,8,1))\n+COUNTIFS(D$16:D$381,\"NK\",B$16:B$381,\">=\"&DATE(StartÅr,7,1),B$16:B$381,\"<\"&DATE(StartÅr,8,1))","v":0},{"$f":"TEXT(SUM(IF(TRUE,(7=MONTH(B$16:B$381))*(E$16:E$381),SUM(1*(E$16:E$381)))),IF(C$2,\"[t]:mm\",\"0,0#\"))","v":"0:00"},"0:00","0:00"]
[null,null,null,null,null,"Augusti",{"$f":"COUNTIFS(D$16:D$381,\">\"&0,B$16:B$381,\">=\"&DATE(StartÅr,8,1),B$16:B$381,\"<\"&DATE(StartÅr,9,1))\n+COUNTIFS(D$16:D$381,\"F\",B$16:B$381,\">=\"&DATE(StartÅr,8,1),B$16:B$381,\"<\"&DATE(StartÅr,9,1))\n+COUNTIFS(D$16:D$381,\"EN\",B$16:B$381,\">=\"&DATE(StartÅr,8,1),B$16:B$381,\"<\"&DATE(StartÅr,9,1))\n+COUNTIFS(D$16:D$381,\"0-dag\",B$16:B$381,\">=\"&DATE(StartÅr,8,1),B$16:B$381,\"<\"&DATE(StartÅr,9,1))\n+COUNTIFS(D$16:D$381,\"NK\",B$16:B$381,\">=\"&DATE(StartÅr,8,1),B$16:B$381,\"<\"&DATE(StartÅr,9,1))","v":0},{"$f":"TEXT(SUM(IF(TRUE,(8=MONTH(B$16:B$381))*(E$16:E$381),SUM(1*(E$16:E$381)))),IF(C$2,\"[t]:mm\",\"0,0#\"))","v":"0:00"},"0:00","0:00"]
[null,null,null,null,null,"September",{"$f":"COUNTIFS(D$16:D$381,\">\"&0,B$16:B$381,\">=\"&DATE(StartÅr,9,1),B$16:B$381,\"<\"&DATE(StartÅr,10,1))\n+COUNTIFS(D$16:D$381,\"F\",B$16:B$381,\">=\"&DATE(StartÅr,9,1),B$16:B$381,\"<\"&DATE(StartÅr,10,1))\n+COUNTIFS(D$16:D$381,\"EN\",B$16:B$381,\">=\"&DATE(StartÅr,9,1),B$16:B$381,\"<\"&DATE(StartÅr,10,1))\n+COUNTIFS(D$16:D$381,\"0-dag\",B$16:B$381,\">=\"&DATE(StartÅr,9,1),B$16:B$381,\"<\"&DATE(StartÅr,10,1))\n+COUNTIFS(D$16:D$381,\"NK\",B$16:B$381,\">=\"&DATE(StartÅr,9,1),B$16:B$381,\"<\"&DATE(StartÅr,10,1))","v":0},{"$f":"TEXT(SUM(IF(TRUE,(9=MONTH(B$16:B$381))*(E$16:E$381),SUM(1*(E$16:E$381)))),IF(C$2,\"[t]:mm\",\"0,0#\"))","v":"0:00"},"0:00","0:00"]
[null,null,null,null,null,"Oktober",{"$f":"COUNTIFS(D$16:D$381,\">\"&0,B$16:B$381,\">=\"&DATE(StartÅr,10,1),B$16:B$381,\"<\"&DATE(StartÅr,11,1))\n+COUNTIFS(D$16:D$381,\"F\",B$16:B$381,\">=\"&DATE(StartÅr,10,1),B$16:B$381,\"<\"&DATE(StartÅr,11,1))\n+COUNTIFS(D$16:D$381,\"EN\",B$16:B$381,\">=\"&DATE(StartÅr,10,1),B$16:B$381,\"<\"&DATE(StartÅr,11,1))\n+COUNTIFS(D$16:D$381,\"0-dag\",B$16:B$381,\">=\"&DATE(StartÅr,10,1),B$16:B$381,\"<\"&DATE(StartÅr,11,1))\n+COUNTIFS(D$16:D$381,\"NK\",B$16:B$381,\">=\"&DATE(StartÅr,10,1),B$16:B$381,\"<\"&DATE(StartÅr,11,1))","v":0},{"$f":"TEXT(SUM(IF(TRUE,(10=MONTH(B$16:B$381))*(E$16:E$381),SUM(1*(E$16:E$381)))),IF(C$2,\"[t]:mm\",\"0,0#\"))","v":"0:00"},"0:00","0:00"]
[null,null,null,null,null,"November",{"$f":"COUNTIFS(D$16:D$381,\">\"&0,B$16:B$381,\">=\"&DATE(StartÅr,11,1),B$16:B$381,\"<\"&DATE(StartÅr,12,1))\n+COUNTIFS(D$16:D$381,\"F\",B$16:B$381,\">=\"&DATE(StartÅr,11,1),B$16:B$381,\"<\"&DATE(StartÅr,12,1))\n+COUNTIFS(D$16:D$381,\"EN\",B$16:B$381,\">=\"&DATE(StartÅr,11,1),B$16:B$381,\"<\"&DATE(StartÅr,12,1))\n+COUNTIFS(D$16:D$381,\"0-dag\",B$16:B$381,\">=\"&DATE(StartÅr,11,1),B$16:B$381,\"<\"&DATE(StartÅr,12,1))\n+COUNTIFS(D$16:D$381,\"NK\",B$16:B$381,\">=\"&DATE(StartÅr,11,1),B$16:B$381,\"<\"&DATE(StartÅr,12,1))","v":0},{"$f":"TEXT(SUM(IF(TRUE,(11=MONTH(B$16:B$381))*(E$16:E$381),SUM(1*(E$16:E$381)))),IF(C$2,\"[t]:mm\",\"0,0#\"))","v":"0:00"},"0:00","0:00"]
[null,null,null,null,null,"December",{"$f":"COUNTIFS(D$16:D$381,\">\"&0,B$16:B$381,\">=\"&DATE(StartÅr,12,1),B$16:B$381,\"<=\"&DATE(StartÅr,12,31))\n+COUNTIFS(D$16:D$381,\"F\",B$16:B$381,\">=\"&DATE(StartÅr,12,1),B$16:B$381,\"<=\"&DATE(StartÅr,12,31))\n+COUNTIFS(D$16:D$381,\"EN\",B$16:B$381,\">=\"&DATE(StartÅr,12,1),B$16:B$381,\"<=\"&DATE(StartÅr,12,31))\n+COUNTIFS(D$16:D$381,\"0-dag\",B$16:B$381,\">=\"&DATE(StartÅr,12,1),B$16:B$381,\"<=\"&DATE(StartÅr,12,31))\n+COUNTIFS(D$16:D$381,\"NK\",B$16:B$381,\">=\"&DATE(StartÅr,12,1),B$16:B$381,\"<=\"&DATE(StartÅr,12,31))","v":0},{"$f":"TEXT(SUM(IF(TRUE,(12=MONTH(B$16:B$381))*(E$16:E$381),SUM(1*(E$16:E$381)))),IF(C$2,\"[t]:mm\",\"0,0#\"))","v":"0:00"},"0:00","0:00"]
[]
[null,null,null,"Arbetstid"]
[{"$f":"IF(OR(WEEKDAY(B16)=2,B16=DATE(YEAR(B16),MONTH(B16),1)),\"V. \"&WEEKNUM(B16,21),\"\")","v":"V. 1"},{"$f":"DATE(StartÅr,1,1)","v":"2018-01-01"},{"$f":"PROPER(TEXT(B16,\"dddd\"))","v":"Måndag"},null,{"$f":"IF(ISNUMBER(D16),IF($C$2,TEXT(TEXT(D16,\"00\\:00\"),\"[t]:mm\"),\n(TEXT(D16,\"00\\:00\"))*24),0)","v":0},{"$f":"IF(OR(ISNUMBER(D16),D16=\"F\",D16=\"EN\",D16=\"0-dag\",D16=\"FV\",D16=\"NK\"),TEXT(\nIF(OR(D16=\"F\",D16=\"EN\",D16=\"0-dag\",D16=\"NK\"),0,\nIF(D16=\"FV\",TEXT(Idealtid,\"00\\:00\"),\nIF(D16>Idealtid,(TEXT(D16,\"00\\:00\")-TEXT(Idealtid,\"00\\:00\")),(TEXT(Idealtid,\"00\\:00\")-TEXT(D16,\"00\\:00\")))))\n*IF($C$2,1,24),\nIF($C$2,\"[t]:mm\",\"0,0#\")),0)","v":0},{"$f":"IFERROR(VLOOKUP(B16,Helgdagar!A$2:C$24,3,FALSE),\"\")&\nIFERROR(VLOOKUP(B16,Helgdagar!E$2:G$24,3,FALSE),\"\")&\nIFERROR(VLOOKUP(B16,Helgdagar!I$2:K$24,3,FALSE),\"\")","v":"Nyårsdagen"}]
[{"$f":"IF(OR(WEEKDAY(B17)=2,B17=DATE(YEAR(B17),MONTH(B17),1)),\"V. \"&WEEKNUM(B17,21),\"\")","v":""},{"$f":"B16+1","v":"2018-01-02"},{"$f":"PROPER(TEXT(B17,\"dddd\"))","v":"Tisdag"},null,0,0,{"$f":"IFERROR(VLOOKUP(B17,Helgdagar!A$2:C$24,3,FALSE),\"\")&\nIFERROR(VLOOKUP(B17,Helgdagar!E$2:G$24,3,FALSE),\"\")&\nIFERROR(VLOOKUP(B17,Helgdagar!I$2:K$24,3,FALSE),\"\")","v":""}]
["",{"$f":"B17+1","v":"2018-01-03"},{"$f":"PROPER(TEXT(B18,\"dddd\"))","v":"Onsdag"},null,0,0,{"$f":"IFERROR(VLOOKUP(B18,Helgdagar!A$2:C$24,3,FALSE),\"\")&\nIFERROR(VLOOKUP(B18,Helgdagar!E$2:G$24,3,FALSE),\"\")&\nIFERROR(VLOOKUP(B18,Helgdagar!I$2:K$24,3,FALSE),\"\")","v":""}]
["","2018-01-04","Torsdag",null,0,0,{"$f":"IFERROR(VLOOKUP(B19,Helgdagar!A$2:C$24,3,FALSE),\"\")&\nIFERROR(VLOOKUP(B19,Helgdagar!E$2:G$24,3,FALSE),\"\")&\nIFERROR(VLOOKUP(B19,Helgdagar!I$2:K$24,3,FALSE),\"\")","v":""}]
["","2018-01-05","Fredag",null,0,0,{"$f":"IFERROR(VLOOKUP(B20,Helgdagar!A$2:C$24,3,FALSE),\"\")&\nIFERROR(VLOOKUP(B20,Helgdagar!E$2:G$24,3,FALSE),\"\")&\nIFERROR(VLOOKUP(B20,Helgdagar!I$2:K$24,3,FALSE),\"\")","v":""}]
["","2018-01-06","Lördag",null,0,0,{"$f":"IFERROR(VLOOKUP(B21,Helgdagar!A$2:C$24,3,FALSE),\"\")&\nIFERROR(VLOOKUP(B21,Helgdagar!E$2:G$24,3,FALSE),\"\")&\nIFERROR(VLOOKUP(B21,Helgdagar!I$2:K$24,3,FALSE),\"\")","v":"Trettondedag jul"}]
["","2018-01-07","Söndag",null,0,0,{"$f":"IFERROR(VLOOKUP(B22,Helgdagar!A$2:C$24,3,FALSE),\"\")&\nIFERROR(VLOOKUP(B22,Helgdagar!E$2:G$24,3,FALSE),\"\")&\nIFERROR(VLOOKUP(B22,Helgdagar!I$2:K$24,3,FALSE),\"\")","v":""}]
["V. 2","2018-01-08","Måndag",null,0,0,{"$f":"IFERROR(VLOOKUP(B23,Helgdagar!A$2:C$24,3,FALSE),\"\")&\nIFERROR(VLOOKUP(B23,Helgdagar!E$2:G$24,3,FALSE),\"\")&\nIFERROR(VLOOKUP(B23,Helgdagar!I$2:K$24,3,FALSE),\"\")","v":""}]
["","2018-01-09","Tisdag",null,0,0,{"$f":"IFERROR(VLOOKUP(B24,Helgdagar!A$2:C$24,3,FALSE),\"\")&\nIFERROR(VLOOKUP(B24,Helgdagar!E$2:G$24,3,FALSE),\"\")&\nIFERROR(VLOOKUP(B24,Helgdagar!I$2:K$24,3,FALSE),\"\")","v":""}]
["","2018-01-10","Onsdag",null,0,0,{"$f":"IFERROR(VLOOKUP(B25,Helgdagar!A$2:C$24,3,FALSE),\"\")&\nIFERROR(VLOOKUP(B25,Helgdagar!E$2:G$24,3,FALSE),\"\")&\nIFERROR(VLOOKUP(B25,Helgdagar!I$2:K$24,3,FALSE),\"\")","v":""}]
["","2018-01-11","Torsdag",null,0,0,{"$f":"IFERROR(VLOOKUP(B26,Helgdagar!A$2:C$24,3,FALSE),\"\")&\nIFERROR(VLOOKUP(B26,Helgdagar!E$2:G$24,3,FALSE),\"\")&\nIFERROR(VLOOKUP(B26,Helgdagar!I$2:K$24,3,FALSE),\"\")","v":""}]
["","2018-01-12","Fredag",null,0,0,{"$f":"IFERROR(VLOOKUP(B27,Helgdagar!A$2:C$24,3,FALSE),\"\")&\nIFERROR(VLOOKUP(B27,Helgdagar!E$2:G$24,3,FALSE),\"\")&\nIFERROR(VLOOKUP(B27,Helgdagar!I$2:K$24,3,FALSE),\"\")","v":""}]
["","2018-01-13","Lördag",null,0,0,{"$f":"IFERROR(VLOOKUP(B28,Helgdagar!A$2:C$24,3,FALSE),\"\")&\nIFERROR(VLOOKUP(B28,Helgdagar!E$2:G$24,3,FALSE),\"\")&\nIFERROR(VLOOKUP(B28,Helgdagar!I$2:K$24,3,FALSE),\"\")","v":""}]
["","2018-01-14","Söndag",null,0,0,{"$f":"IFERROR(VLOOKUP(B29,Helgdagar!A$2:C$24,3,FALSE),\"\")&\nIFERROR(VLOOKUP(B29,Helgdagar!E$2:G$24,3,FALSE),\"\")&\nIFERROR(VLOOKUP(B29,Helgdagar!I$2:K$24,3,FALSE),\"\")","v":""}]
["V. 3","2018-01-15","Måndag",null,0,0,{"$f":"IFERROR(VLOOKUP(B30,Helgdagar!A$2:C$24,3,FALSE),\"\")&\nIFERROR(VLOOKUP(B30,Helgdagar!E$2:G$24,3,FALSE),\"\")&\nIFERROR(VLOOKUP(B30,Helgdagar!I$2:K$24,3,FALSE),\"\")","v":""}]
["","2018-01-16","Tisdag",null,0,0,{"$f":"IFERROR(VLOOKUP(B31,Helgdagar!A$2:C$24,3,FALSE),\"\")&\nIFERROR(VLOOKUP(B31,Helgdagar!E$2:G$24,3,FALSE),\"\")&\nIFERROR(VLOOKUP(B31,Helgdagar!I$2:K$24,3,FALSE),\"\")","v":""}]
["","2018-01-17","Onsdag",null,0,0,{"$f":"IFERROR(VLOOKUP(B32,Helgdagar!A$2:C$24,3,FALSE),\"\")&\nIFERROR(VLOOKUP(B32,Helgdagar!E$2:G$24,3,FALSE),\"\")&\nIFERROR(VLOOKUP(B32,Helgdagar!I$2:K$24,3,FALSE),\"\")","v":""}]
["","2018-01-18","Torsdag",null,0,0,{"$f":"IFERROR(VLOOKUP(B33,Helgdagar!A$2:C$24,3,FALSE),\"\")&\nIFERROR(VLOOKUP(B33,Helgdagar!E$2:G$24,3,FALSE),\"\")&\nIFERROR(VLOOKUP(B33,Helgdagar!I$2:K$24,3,FALSE),\"\")","v":""}]
["","2018-01-19","Fredag",null,0,0,{"$f":"IFERROR(VLOOKUP(B34,Helgdagar!A$2:C$24,3,FALSE),\"\")&\nIFERROR(VLOOKUP(B34,Helgdagar!E$2:G$24,3,FALSE),\"\")&\nIFERROR(VLOOKUP(B34,Helgdagar!I$2:K$24,3,FALSE),\"\")","v":""}]
["","2018-01-20","Lördag",null,0,0,{"$f":"IFERROR(VLOOKUP(B35,Helgdagar!A$2:C$24,3,FALSE),\"\")&\nIFERROR(VLOOKUP(B35,Helgdagar!E$2:G$24,3,FALSE),\"\")&\nIFERROR(VLOOKUP(B35,Helgdagar!I$2:K$24,3,FALSE),\"\")","v":""}]
["","2018-01-21","Söndag",null,0,0,{"$f":"IFERROR(VLOOKUP(B36,Helgdagar!A$2:C$24,3,FALSE),\"\")&\nIFERROR(VLOOKUP(B36,Helgdagar!E$2:G$24,3,FALSE),\"\")&\nIFERROR(VLOOKUP(B36,Helgdagar!I$2:K$24,3,FALSE),\"\")","v":""}]
["V. 4","2018-01-22","Måndag",null,0,0,{"$f":"IFERROR(VLOOKUP(B37,Helgdagar!A$2:C$24,3,FALSE),\"\")&\nIFERROR(VLOOKUP(B37,Helgdagar!E$2:G$24,3,FALSE),\"\")&\nIFERROR(VLOOKUP(B37,Helgdagar!I$2:K$24,3,FALSE),\"\")","v":""}]
["","2018-01-23","Tisdag",null,0,0,{"$f":"IFERROR(VLOOKUP(B38,Helgdagar!A$2:C$24,3,FALSE),\"\")&\nIFERROR(VLOOKUP(B38,Helgdagar!E$2:G$24,3,FALSE),\"\")&\nIFERROR(VLOOKUP(B38,Helgdagar!I$2:K$24,3,FALSE),\"\")","v":""}]
["","2018-01-24","Onsdag",null,0,0,{"$f":"IFERROR(VLOOKUP(B39,Helgdagar!A$2:C$24,3,FALSE),\"\")&\nIFERROR(VLOOKUP(B39,Helgdagar!E$2:G$24,3,FALSE),\"\")&\nIFERROR(VLOOKUP(B39,Helgdagar!I$2:K$24,3,FALSE),\"\")","v":""}]
["","2018-01-25","Torsdag",null,0,0,{"$f":"IFERROR(VLOOKUP(B40,Helgdagar!A$2:C$24,3,FALSE),\"\")&\nIFERROR(VLOOKUP(B40,Helgdagar!E$2:G$24,3,FALSE),\"\")&\nIFERROR(VLOOKUP(B40,Helgdagar!I$2:K$24,3,FALSE),\"\")","v":""}]
["","2018-01-26","Fredag",null,0,0,{"$f":"IFERROR(VLOOKUP(B41,Helgdagar!A$2:C$24,3,FALSE),\"\")&\nIFERROR(VLOOKUP(B41,Helgdagar!E$2:G$24,3,FALSE),\"\")&\nIFERROR(VLOOKUP(B41,Helgdagar!I$2:K$24,3,FALSE),\"\")","v":""}]
["","2018-01-27","Lördag",null,0,0,{"$f":"IFERROR(VLOOKUP(B42,Helgdagar!A$2:C$24,3,FALSE),\"\")&\nIFERROR(VLOOKUP(B42,Helgdagar!E$2:G$24,3,FALSE),\"\")&\nIFERROR(VLOOKUP(B42,Helgdagar!I$2:K$24,3,FALSE),\"\")","v":""}]
["","2018-01-28","Söndag",null,0,0,{"$f":"IFERROR(VLOOKUP(B43,Helgdagar!A$2:C$24,3,FALSE),\"\")&\nIFERROR(VLOOKUP(B43,Helgdagar!E$2:G$24,3,FALSE),\"\")&\nIFERROR(VLOOKUP(B43,Helgdagar!I$2:K$24,3,FALSE),\"\")","v":""}]
["V. 5","2018-01-29","Måndag",null,0,0,{"$f":"IFERROR(VLOOKUP(B44,Helgdagar!A$2:C$24,3,FALSE),\"\")&\nIFERROR(VLOOKUP(B44,Helgdagar!E$2:G$24,3,FALSE),\"\")&\nIFERROR(VLOOKUP(B44,Helgdagar!I$2:K$24,3,FALSE),\"\")","v":""}]
["","2018-01-30","Tisdag",null,0,0,{"$f":"IFERROR(VLOOKUP(B45,Helgdagar!A$2:C$24,3,FALSE),\"\")&\nIFERROR(VLOOKUP(B45,Helgdagar!E$2:G$24,3,FALSE),\"\")&\nIFERROR(VLOOKUP(B45,Helgdagar!I$2:K$24,3,FALSE),\"\")","v":""}]
["","2018-01-31","Onsdag",null,0,0,{"$f":"IFERROR(VLOOKUP(B46,Helgdagar!A$2:C$24,3,FALSE),\"\")&\nIFERROR(VLOOKUP(B46,Helgdagar!E$2:G$24,3,FALSE),\"\")&\nIFERROR(VLOOKUP(B46,Helgdagar!I$2:K$24,3,FALSE),\"\")","v":""}]
["V. 5","2018-02-01","Torsdag",null,0,0,{"$f":"IFERROR(VLOOKUP(B47,Helgdagar!A$2:C$24,3,FALSE),\"\")&\nIFERROR(VLOOKUP(B47,Helgdagar!E$2:G$24,3,FALSE),\"\")&\nIFERROR(VLOOKUP(B47,Helgdagar!I$2:K$24,3,FALSE),\"\")","v":""}]
["","2018-02-02","Fredag",null,0,0,{"$f":"IFERROR(VLOOKUP(B48,Helgdagar!A$2:C$24,3,FALSE),\"\")&\nIFERROR(VLOOKUP(B48,Helgdagar!E$2:G$24,3,FALSE),\"\")&\nIFERROR(VLOOKUP(B48,Helgdagar!I$2:K$24,3,FALSE),\"\")","v":""}]
["","2018-02-03","Lördag",null,0,0,{"$f":"IFERROR(VLOOKUP(B49,Helgdagar!A$2:C$24,3,FALSE),\"\")&\nIFERROR(VLOOKUP(B49,Helgdagar!E$2:G$24,3,FALSE),\"\")&\nIFERROR(VLOOKUP(B49,Helgdagar!I$2:K$24,3,FALSE),\"\")","v":""}]
["","2018-02-04","Söndag",null,0,0,{"$f":"IFERROR(VLOOKUP(B50,Helgdagar!A$2:C$24,3,FALSE),\"\")&\nIFERROR(VLOOKUP(B50,Helgdagar!E$2:G$24,3,FALSE),\"\")&\nIFERROR(VLOOKUP(B50,Helgdagar!I$2:K$24,3,FALSE),\"\")","v":""}]
["V. 6","2018-02-05","Måndag",null,0,0,{"$f":"IFERROR(VLOOKUP(B51,Helgdagar!A$2:C$24,3,FALSE),\"\")&\nIFERROR(VLOOKUP(B51,Helgdagar!E$2:G$24,3,FALSE),\"\")&\nIFERROR(VLOOKUP(B51,Helgdagar!I$2:K$24,3,FALSE),\"\")","v":""}]
["","2018-02-06","Tisdag",null,0,0,{"$f":"IFERROR(VLOOKUP(B52,Helgdagar!A$2:C$24,3,FALSE),\"\")&\nIFERROR(VLOOKUP(B52,Helgdagar!E$2:G$24,3,FALSE),\"\")&\nIFERROR(VLOOKUP(B52,Helgdagar!I$2:K$24,3,FALSE),\"\")","v":""}]
["","2018-02-07","Onsdag",null,0,0,{"$f":"IFERROR(VLOOKUP(B53,Helgdagar!A$2:C$24,3,FALSE),\"\")&\nIFERROR(VLOOKUP(B53,Helgdagar!E$2:G$24,3,FALSE),\"\")&\nIFERROR(VLOOKUP(B53,Helgdagar!I$2:K$24,3,FALSE),\"\")","v":""}]
["","2018-02-08","Torsdag",null,0,0,{"$f":"IFERROR(VLOOKUP(B54,Helgdagar!A$2:C$24,3,FALSE),\"\")&\nIFERROR(VLOOKUP(B54,Helgdagar!E$2:G$24,3,FALSE),\"\")&\nIFERROR(VLOOKUP(B54,Helgdagar!I$2:K$24,3,FALSE),\"\")","v":""}]
["","2018-02-09","Fredag",null,0,0,{"$f":"IFERROR(VLOOKUP(B55,Helgdagar!A$2:C$24,3,FALSE),\"\")&\nIFERROR(VLOOKUP(B55,Helgdagar!E$2:G$24,3,FALSE),\"\")&\nIFERROR(VLOOKUP(B55,Helgdagar!I$2:K$24,3,FALSE),\"\")","v":""}]
["","2018-02-10","Lördag",null,0,0,{"$f":"IFERROR(VLOOKUP(B56,Helgdagar!A$2:C$24,3,FALSE),\"\")&\nIFERROR(VLOOKUP(B56,Helgdagar!E$2:G$24,3,FALSE),\"\")&\nIFERROR(VLOOKUP(B56,Helgdagar!I$2:K$24,3,FALSE),\"\")","v":""}]
["","2018-02-11","Söndag",null,0,0,{"$f":"IFERROR(VLOOKUP(B57,Helgdagar!A$2:C$24,3,FALSE),\"\")&\nIFERROR(VLOOKUP(B57,Helgdagar!E$2:G$24,3,FALSE),\"\")&\nIFERROR(VLOOKUP(B57,Helgdagar!I$2:K$24,3,FALSE),\"\")","v":""}]
["V. 7","2018-02-12","Måndag",null,0,0,{"$f":"IFERROR(VLOOKUP(B58,Helgdagar!A$2:C$24,3,FALSE),\"\")&\nIFERROR(VLOOKUP(B58,Helgdagar!E$2:G$24,3,FALSE),\"\")&\nIFERROR(VLOOKUP(B58,Helgdagar!I$2:K$24,3,FALSE),\"\")","v":""}]
["","2018-02-13","Tisdag",null,0,0,{"$f":"IFERROR(VLOOKUP(B59,Helgdagar!A$2:C$24,3,FALSE),\"\")&\nIFERROR(VLOOKUP(B59,Helgdagar!E$2:G$24,3,FALSE),\"\")&\nIFERROR(VLOOKUP(B59,Helgdagar!I$2:K$24,3,FALSE),\"\")","v":""}]
["","2018-02-14","Onsdag",null,0,0,{"$f":"IFERROR(VLOOKUP(B60,Helgdagar!A$2:C$24,3,FALSE),\"\")&\nIFERROR(VLOOKUP(B60,Helgdagar!E$2:G$24,3,FALSE),\"\")&\nIFERROR(VLOOKUP(B60,Helgdagar!I$2:K$24,3,FALSE),\"\")","v":""}]
["","2018-02-15","Torsdag",null,0,0,{"$f":"IFERROR(VLOOKUP(B61,Helgdagar!A$2:C$24,3,FALSE),\"\")&\nIFERROR(VLOOKUP(B61,Helgdagar!E$2:G$24,3,FALSE),\"\")&\nIFERROR(VLOOKUP(B61,Helgdagar!I$2:K$24,3,FALSE),\"\")","v":""}]
["","2018-02-16","Fredag",null,0,0,{"$f":"IFERROR(VLOOKUP(B62,Helgdagar!A$2:C$24,3,FALSE),\"\")&\nIFERROR(VLOOKUP(B62,Helgdagar!E$2:G$24,3,FALSE),\"\")&\nIFERROR(VLOOKUP(B62,Helgdagar!I$2:K$24,3,FALSE),\"\")","v":""}]
["","2018-02-17","Lördag",null,0,0,{"$f":"IFERROR(VLOOKUP(B63,Helgdagar!A$2:C$24,3,FALSE),\"\")&\nIFERROR(VLOOKUP(B63,Helgdagar!E$2:G$24,3,FALSE),\"\")&\nIFERROR(VLOOKUP(B63,Helgdagar!I$2:K$24,3,FALSE),\"\")","v":""}]
["","2018-02-18","Söndag",null,0,0,{"$f":"IFERROR(VLOOKUP(B64,Helgdagar!A$2:C$24,3,FALSE),\"\")&\nIFERROR(VLOOKUP(B64,Helgdagar!E$2:G$24,3,FALSE),\"\")&\nIFERROR(VLOOKUP(B64,Helgdagar!I$2:K$24,3,FALSE),\"\")","v":""}]
["V. 8","2018-02-19","Måndag",null,0,0,{"$f":"IFERROR(VLOOKUP(B65,Helgdagar!A$2:C$24,3,FALSE),\"\")&\nIFERROR(VLOOKUP(B65,Helgdagar!E$2:G$24,3,FALSE),\"\")&\nIFERROR(VLOOKUP(B65,Helgdagar!I$2:K$24,3,FALSE),\"\")","v":""}]
["","2018-02-20","Tisdag",null,0,0,{"$f":"IFERROR(VLOOKUP(B66,Helgdagar!A$2:C$24,3,FALSE),\"\")&\nIFERROR(VLOOKUP(B66,Helgdagar!E$2:G$24,3,FALSE),\"\")&\nIFERROR(VLOOKUP(B66,Helgdagar!I$2:K$24,3,FALSE),\"\")","v":""}]
["","2018-02-21","Onsdag",null,0,0,{"$f":"IFERROR(VLOOKUP(B67,Helgdagar!A$2:C$24,3,FALSE),\"\")&\nIFERROR(VLOOKUP(B67,Helgdagar!E$2:G$24,3,FALSE),\"\")&\nIFERROR(VLOOKUP(B67,Helgdagar!I$2:K$24,3,FALSE),\"\")","v":""}]
["","2018-02-22","Torsdag",null,0,0,{"$f":"IFERROR(VLOOKUP(B68,Helgdagar!A$2:C$24,3,FALSE),\"\")&\nIFERROR(VLOOKUP(B68,Helgdagar!E$2:G$24,3,FALSE),\"\")&\nIFERROR(VLOOKUP(B68,Helgdagar!I$2:K$24,3,FALSE),\"\")","v":""}]
["","2018-02-23","Fredag",null,0,0,{"$f":"IFERROR(VLOOKUP(B69,Helgdagar!A$2:C$24,3,FALSE),\"\")&\nIFERROR(VLOOKUP(B69,Helgdagar!E$2:G$24,3,FALSE),\"\")&\nIFERROR(VLOOKUP(B69,Helgdagar!I$2:K$24,3,FALSE),\"\")","v":""}]
["","2018-02-24","Lördag",null,0,0,{"$f":"IFERROR(VLOOKUP(B70,Helgdagar!A$2:C$24,3,FALSE),\"\")&\nIFERROR(VLOOKUP(B70,Helgdagar!E$2:G$24,3,FALSE),\"\")&\nIFERROR(VLOOKUP(B70,Helgdagar!I$2:K$24,3,FALSE),\"\")","v":""}]
["","2018-02-25","Söndag",null,0,0,{"$f":"IFERROR(VLOOKUP(B71,Helgdagar!A$2:C$24,3,FALSE),\"\")&\nIFERROR(VLOOKUP(B71,Helgdagar!E$2:G$24,3,FALSE),\"\")&\nIFERROR(VLOOKUP(B71,Helgdagar!I$2:K$24,3,FALSE),\"\")","v":""}]
["V. 9","2018-02-26","Måndag",null,0,0,{"$f":"IFERROR(VLOOKUP(B72,Helgdagar!A$2:C$24,3,FALSE),\"\")&\nIFERROR(VLOOKUP(B72,Helgdagar!E$2:G$24,3,FALSE),\"\")&\nIFERROR(VLOOKUP(B72,Helgdagar!I$2:K$24,3,FALSE),\"\")","v":""}]
["","2018-02-27","Tisdag",null,0,0,{"$f":"IFERROR(VLOOKUP(B73,Helgdagar!A$2:C$24,3,FALSE),\"\")&\nIFERROR(VLOOKUP(B73,Helgdagar!E$2:G$24,3,FALSE),\"\")&\nIFERROR(VLOOKUP(B73,Helgdagar!I$2:K$24,3,FALSE),\"\")","v":""}]
["","2018-02-28","Onsdag",null,0,0,{"$f":"IFERROR(VLOOKUP(B74,Helgdagar!A$2:C$24,3,FALSE),\"\")&\nIFERROR(VLOOKUP(B74,Helgdagar!E$2:G$24,3,FALSE),\"\")&\nIFERROR(VLOOKUP(B74,Helgdagar!I$2:K$24,3,FALSE),\"\")","v":""}]
["V. 9","2018-03-01","Torsdag",null,0,0,{"$f":"IFERROR(VLOOKUP(B75,Helgdagar!A$2:C$24,3,FALSE),\"\")&\nIFERROR(VLOOKUP(B75,Helgdagar!E$2:G$24,3,FALSE),\"\")&\nIFERROR(VLOOKUP(B75,Helgdagar!I$2:K$24,3,FALSE),\"\")","v":""}]
["","2018-03-02","Fredag",null,0,0,{"$f":"IFERROR(VLOOKUP(B76,Helgdagar!A$2:C$24,3,FALSE),\"\")&\nIFERROR(VLOOKUP(B76,Helgdagar!E$2:G$24,3,FALSE),\"\")&\nIFERROR(VLOOKUP(B76,Helgdagar!I$2:K$24,3,FALSE),\"\")","v":""}]
["","2018-03-03","Lördag",null,0,0,{"$f":"IFERROR(VLOOKUP(B77,Helgdagar!A$2:C$24,3,FALSE),\"\")&\nIFERROR(VLOOKUP(B77,Helgdagar!E$2:G$24,3,FALSE),\"\")&\nIFERROR(VLOOKUP(B77,Helgdagar!I$2:K$24,3,FALSE),\"\")","v":""}]
["","2018-03-04","Söndag",null,0,0,{"$f":"IFERROR(VLOOKUP(B78,Helgdagar!A$2:C$24,3,FALSE),\"\")&\nIFERROR(VLOOKUP(B78,Helgdagar!E$2:G$24,3,FALSE),\"\")&\nIFERROR(VLOOKUP(B78,Helgdagar!I$2:K$24,3,FALSE),\"\")","v":""}]
["V. 10","2018-03-05","Måndag",null,0,0,{"$f":"IFERROR(VLOOKUP(B79,Helgdagar!A$2:C$24,3,FALSE),\"\")&\nIFERROR(VLOOKUP(B79,Helgdagar!E$2:G$24,3,FALSE),\"\")&\nIFERROR(VLOOKUP(B79,Helgdagar!I$2:K$24,3,FALSE),\"\")","v":""}]
["","2018-03-06","Tisdag",null,{"$f":"IF(ISNUMBER(D80),IF($C$2,TEXT(TEXT(D80,\"00\\:00\"),\"[t]:mm\"),\n(TEXT(D80,\"00\\:00\"))*24),0)","v":0},{"$f":"IF(OR(ISNUMBER(D80),D80=\"F\",D80=\"EN\",D80=\"0-dag\",D80=\"FV\",D80=\"NK\"),TEXT(\nIF(OR(D80=\"F\",D80=\"EN\",D80=\"0-dag\",D80=\"NK\"),0,\nIF(D80=\"FV\",TEXT(Idealtid,\"00\\:00\"),\nIF(D80>Idealtid,(TEXT(D80,\"00\\:00\")-TEXT(Idealtid,\"00\\:00\")),(TEXT(Idealtid,\"00\\:00\")-TEXT(D80,\"00\\:00\")))))\n*IF($C$2,1,24),\nIF($C$2,\"[t]:mm\",\"0,0#\")),0)","v":0},{"$f":"IFERROR(VLOOKUP(B80,Helgdagar!A$2:C$24,3,FALSE),\"\")&\nIFERROR(VLOOKUP(B80,Helgdagar!E$2:G$24,3,FALSE),\"\")&\nIFERROR(VLOOKUP(B80,Helgdagar!I$2:K$24,3,FALSE),\"\")","v":""}]
[{"$f":"IF(OR(WEEKDAY(B81)=2,B81=DATE(YEAR(B81),MONTH(B81),1)),\"V. \"&WEEKNUM(B81,21),\"\")","v":""},"2018-03-07","Onsdag",null,0,0,{"$f":"IFERROR(VLOOKUP(B81,Helgdagar!A$2:C$24,3,FALSE),\"\")&\nIFERROR(VLOOKUP(B81,Helgdagar!E$2:G$24,3,FALSE),\"\")&\nIFERROR(VLOOKUP(B81,Helgdagar!I$2:K$24,3,FALSE),\"\")","v":""}]
["",{"$f":"B81+1","v":"2018-03-08"},{"$f":"PROPER(TEXT(B82,\"dddd\"))","v":"Torsdag"},null,0,0,{"$f":"IFERROR(VLOOKUP(B82,Helgdagar!A$2:C$24,3,FALSE),\"\")&\nIFERROR(VLOOKUP(B82,Helgdagar!E$2:G$24,3,FALSE),\"\")&\nIFERROR(VLOOKUP(B82,Helgdagar!I$2:K$24,3,FALSE),\"\")","v":""}]
["","2018-03-09","Fredag",null,0,0,{"$f":"IFERROR(VLOOKUP(B83,Helgdagar!A$2:C$24,3,FALSE),\"\")&\nIFERROR(VLOOKUP(B83,Helgdagar!E$2:G$24,3,FALSE),\"\")&\nIFERROR(VLOOKUP(B83,Helgdagar!I$2:K$24,3,FALSE),\"\")","v":""}]
["","2018-03-10","Lördag",null,0,0,{"$f":"IFERROR(VLOOKUP(B84,Helgdagar!A$2:C$24,3,FALSE),\"\")&\nIFERROR(VLOOKUP(B84,Helgdagar!E$2:G$24,3,FALSE),\"\")&\nIFERROR(VLOOKUP(B84,Helgdagar!I$2:K$24,3,FALSE),\"\")","v":""}]
["","2018-03-11","Söndag",null,0,0,{"$f":"IFERROR(VLOOKUP(B85,Helgdagar!A$2:C$24,3,FALSE),\"\")&\nIFERROR(VLOOKUP(B85,Helgdagar!E$2:G$24,3,FALSE),\"\")&\nIFERROR(VLOOKUP(B85,Helgdagar!I$2:K$24,3,FALSE),\"\")","v":""}]
["V. 11","2018-03-12","Måndag",null,0,0,{"$f":"IFERROR(VLOOKUP(B86,Helgdagar!A$2:C$24,3,FALSE),\"\")&\nIFERROR(VLOOKUP(B86,Helgdagar!E$2:G$24,3,FALSE),\"\")&\nIFERROR(VLOOKUP(B86,Helgdagar!I$2:K$24,3,FALSE),\"\")","v":""}]
["","2018-03-13","Tisdag",null,0,0,{"$f":"IFERROR(VLOOKUP(B87,Helgdagar!A$2:C$24,3,FALSE),\"\")&\nIFERROR(VLOOKUP(B87,Helgdagar!E$2:G$24,3,FALSE),\"\")&\nIFERROR(VLOOKUP(B87,Helgdagar!I$2:K$24,3,FALSE),\"\")","v":""}]
["","2018-03-14","Onsdag",null,0,0,{"$f":"IFERROR(VLOOKUP(B88,Helgdagar!A$2:C$24,3,FALSE),\"\")&\nIFERROR(VLOOKUP(B88,Helgdagar!E$2:G$24,3,FALSE),\"\")&\nIFERROR(VLOOKUP(B88,Helgdagar!I$2:K$24,3,FALSE),\"\")","v":""}]
["","2018-03-15","Torsdag",null,0,0,{"$f":"IFERROR(VLOOKUP(B89,Helgdagar!A$2:C$24,3,FALSE),\"\")&\nIFERROR(VLOOKUP(B89,Helgdagar!E$2:G$24,3,FALSE),\"\")&\nIFERROR(VLOOKUP(B89,Helgdagar!I$2:K$24,3,FALSE),\"\")","v":""}]
["","2018-03-16","Fredag",null,0,0,{"$f":"IFERROR(VLOOKUP(B90,Helgdagar!A$2:C$24,3,FALSE),\"\")&\nIFERROR(VLOOKUP(B90,Helgdagar!E$2:G$24,3,FALSE),\"\")&\nIFERROR(VLOOKUP(B90,Helgdagar!I$2:K$24,3,FALSE),\"\")","v":""}]
["","2018-03-17","Lördag",null,0,0,{"$f":"IFERROR(VLOOKUP(B91,Helgdagar!A$2:C$24,3,FALSE),\"\")&\nIFERROR(VLOOKUP(B91,Helgdagar!E$2:G$24,3,FALSE),\"\")&\nIFERROR(VLOOKUP(B91,Helgdagar!I$2:K$24,3,FALSE),\"\")","v":""}]
["","2018-03-18","Söndag",null,0,0,{"$f":"IFERROR(VLOOKUP(B92,Helgdagar!A$2:C$24,3,FALSE),\"\")&\nIFERROR(VLOOKUP(B92,Helgdagar!E$2:G$24,3,FALSE),\"\")&\nIFERROR(VLOOKUP(B92,Helgdagar!I$2:K$24,3,FALSE),\"\")","v":""}]
["V. 12","2018-03-19","Måndag",null,0,0,{"$f":"IFERROR(VLOOKUP(B93,Helgdagar!A$2:C$24,3,FALSE),\"\")&\nIFERROR(VLOOKUP(B93,Helgdagar!E$2:G$24,3,FALSE),\"\")&\nIFERROR(VLOOKUP(B93,Helgdagar!I$2:K$24,3,FALSE),\"\")","v":""}]
["","2018-03-20","Tisdag",null,0,0,{"$f":"IFERROR(VLOOKUP(B94,Helgdagar!A$2:C$24,3,FALSE),\"\")&\nIFERROR(VLOOKUP(B94,Helgdagar!E$2:G$24,3,FALSE),\"\")&\nIFERROR(VLOOKUP(B94,Helgdagar!I$2:K$24,3,FALSE),\"\")","v":""}]
["","2018-03-21","Onsdag",null,0,0,{"$f":"IFERROR(VLOOKUP(B95,Helgdagar!A$2:C$24,3,FALSE),\"\")&\nIFERROR(VLOOKUP(B95,Helgdagar!E$2:G$24,3,FALSE),\"\")&\nIFERROR(VLOOKUP(B95,Helgdagar!I$2:K$24,3,FALSE),\"\")","v":""}]
["","2018-03-22","Torsdag",null,0,0,{"$f":"IFERROR(VLOOKUP(B96,Helgdagar!A$2:C$24,3,FALSE),\"\")&\nIFERROR(VLOOKUP(B96,Helgdagar!E$2:G$24,3,FALSE),\"\")&\nIFERROR(VLOOKUP(B96,Helgdagar!I$2:K$24,3,FALSE),\"\")","v":""}]
["","2018-03-23","Fredag",null,0,0,{"$f":"IFERROR(VLOOKUP(B97,Helgdagar!A$2:C$24,3,FALSE),\"\")&\nIFERROR(VLOOKUP(B97,Helgdagar!E$2:G$24,3,FALSE),\"\")&\nIFERROR(VLOOKUP(B97,Helgdagar!I$2:K$24,3,FALSE),\"\")","v":""}]
["","2018-03-24","Lördag",null,0,0,{"$f":"IFERROR(VLOOKUP(B98,Helgdagar!A$2:C$24,3,FALSE),\"\")&\nIFERROR(VLOOKUP(B98,Helgdagar!E$2:G$24,3,FALSE),\"\")&\nIFERROR(VLOOKUP(B98,Helgdagar!I$2:K$24,3,FALSE),\"\")","v":""}]
["","2018-03-25","Söndag",null,0,0,{"$f":"IFERROR(VLOOKUP(B99,Helgdagar!A$2:C$24,3,FALSE),\"\")&\nIFERROR(VLOOKUP(B99,Helgdagar!E$2:G$24,3,FALSE),\"\")&\nIFERROR(VLOOKUP(B99,Helgdagar!I$2:K$24,3,FALSE),\"\")","v":""}]
["V. 13","2018-03-26","Måndag",null,0,0,{"$f":"IFERROR(VLOOKUP(B100,Helgdagar!A$2:C$24,3,FALSE),\"\")&\nIFERROR(VLOOKUP(B100,Helgdagar!E$2:G$24,3,FALSE),\"\")&\nIFERROR(VLOOKUP(B100,Helgdagar!I$2:K$24,3,FALSE),\"\")","v":""}]
["","2018-03-27","Tisdag",null,0,0,{"$f":"IFERROR(VLOOKUP(B101,Helgdagar!A$2:C$24,3,FALSE),\"\")&\nIFERROR(VLOOKUP(B101,Helgdagar!E$2:G$24,3,FALSE),\"\")&\nIFERROR(VLOOKUP(B101,Helgdagar!I$2:K$24,3,FALSE),\"\")","v":""}]
["","2018-03-28","Onsdag",null,0,0,{"$f":"IFERROR(VLOOKUP(B102,Helgdagar!A$2:C$24,3,FALSE),\"\")&\nIFERROR(VLOOKUP(B102,Helgdagar!E$2:G$24,3,FALSE),\"\")&\nIFERROR(VLOOKUP(B102,Helgdagar!I$2:K$24,3,FALSE),\"\")","v":""}]
["","2018-03-29","Torsdag",null,0,0,{"$f":"IFERROR(VLOOKUP(B103,Helgdagar!A$2:C$24,3,FALSE),\"\")&\nIFERROR(VLOOKUP(B103,Helgdagar!E$2:G$24,3,FALSE),\"\")&\nIFERROR(VLOOKUP(B103,Helgdagar!I$2:K$24,3,FALSE),\"\")","v":"Skärtorsdagen"}]
["","2018-03-30","Fredag",null,0,0,{"$f":"IFERROR(VLOOKUP(B104,Helgdagar!A$2:C$24,3,FALSE),\"\")&\nIFERROR(VLOOKUP(B104,Helgdagar!E$2:G$24,3,FALSE),\"\")&\nIFERROR(VLOOKUP(B104,Helgdagar!I$2:K$24,3,FALSE),\"\")","v":"Långfredagen"}]
["","2018-03-31","Lördag",null,0,0,{"$f":"IFERROR(VLOOKUP(B105,Helgdagar!A$2:C$24,3,FALSE),\"\")&\nIFERROR(VLOOKUP(B105,Helgdagar!E$2:G$24,3,FALSE),\"\")&\nIFERROR(VLOOKUP(B105,Helgdagar!I$2:K$24,3,FALSE),\"\")","v":"Påskafton"}]
["V. 13","2018-04-01","Söndag",null,0,0,{"$f":"IFERROR(VLOOKUP(B106,Helgdagar!A$2:C$24,3,FALSE),\"\")&\nIFERROR(VLOOKUP(B106,Helgdagar!E$2:G$24,3,FALSE),\"\")&\nIFERROR(VLOOKUP(B106,Helgdagar!I$2:K$24,3,FALSE),\"\")","v":"Påskdagen"}]
["V. 14","2018-04-02","Måndag",null,0,0,{"$f":"IFERROR(VLOOKUP(B107,Helgdagar!A$2:C$24,3,FALSE),\"\")&\nIFERROR(VLOOKUP(B107,Helgdagar!E$2:G$24,3,FALSE),\"\")&\nIFERROR(VLOOKUP(B107,Helgdagar!I$2:K$24,3,FALSE),\"\")","v":"Annandag påsk"}]
["","2018-04-03","Tisdag",null,0,0,{"$f":"IFERROR(VLOOKUP(B108,Helgdagar!A$2:C$24,3,FALSE),\"\")&\nIFERROR(VLOOKUP(B108,Helgdagar!E$2:G$24,3,FALSE),\"\")&\nIFERROR(VLOOKUP(B108,Helgdagar!I$2:K$24,3,FALSE),\"\")","v":""}]
["","2018-04-04","Onsdag",null,0,0,{"$f":"IFERROR(VLOOKUP(B109,Helgdagar!A$2:C$24,3,FALSE),\"\")&\nIFERROR(VLOOKUP(B109,Helgdagar!E$2:G$24,3,FALSE),\"\")&\nIFERROR(VLOOKUP(B109,Helgdagar!I$2:K$24,3,FALSE),\"\")","v":""}]
["","2018-04-05","Torsdag",null,0,0,{"$f":"IFERROR(VLOOKUP(B110,Helgdagar!A$2:C$24,3,FALSE),\"\")&\nIFERROR(VLOOKUP(B110,Helgdagar!E$2:G$24,3,FALSE),\"\")&\nIFERROR(VLOOKUP(B110,Helgdagar!I$2:K$24,3,FALSE),\"\")","v":""}]
["","2018-04-06","Fredag",null,0,0,{"$f":"IFERROR(VLOOKUP(B111,Helgdagar!A$2:C$24,3,FALSE),\"\")&\nIFERROR(VLOOKUP(B111,Helgdagar!E$2:G$24,3,FALSE),\"\")&\nIFERROR(VLOOKUP(B111,Helgdagar!I$2:K$24,3,FALSE),\"\")","v":""}]
["","2018-04-07","Lördag",null,0,0,{"$f":"IFERROR(VLOOKUP(B112,Helgdagar!A$2:C$24,3,FALSE),\"\")&\nIFERROR(VLOOKUP(B112,Helgdagar!E$2:G$24,3,FALSE),\"\")&\nIFERROR(VLOOKUP(B112,Helgdagar!I$2:K$24,3,FALSE),\"\")","v":""}]
["","2018-04-08","Söndag",null,0,0,{"$f":"IFERROR(VLOOKUP(B113,Helgdagar!A$2:C$24,3,FALSE),\"\")&\nIFERROR(VLOOKUP(B113,Helgdagar!E$2:G$24,3,FALSE),\"\")&\nIFERROR(VLOOKUP(B113,Helgdagar!I$2:K$24,3,FALSE),\"\")","v":""}]
["V. 15","2018-04-09","Måndag",null,0,0,{"$f":"IFERROR(VLOOKUP(B114,Helgdagar!A$2:C$24,3,FALSE),\"\")&\nIFERROR(VLOOKUP(B114,Helgdagar!E$2:G$24,3,FALSE),\"\")&\nIFERROR(VLOOKUP(B114,Helgdagar!I$2:K$24,3,FALSE),\"\")","v":""}]
["","2018-04-10","Tisdag",null,0,0,{"$f":"IFERROR(VLOOKUP(B115,Helgdagar!A$2:C$24,3,FALSE),\"\")&\nIFERROR(VLOOKUP(B115,Helgdagar!E$2:G$24,3,FALSE),\"\")&\nIFERROR(VLOOKUP(B115,Helgdagar!I$2:K$24,3,FALSE),\"\")","v":""}]
["","2018-04-11","Onsdag",null,0,0,{"$f":"IFERROR(VLOOKUP(B116,Helgdagar!A$2:C$24,3,FALSE),\"\")&\nIFERROR(VLOOKUP(B116,Helgdagar!E$2:G$24,3,FALSE),\"\")&\nIFERROR(VLOOKUP(B116,Helgdagar!I$2:K$24,3,FALSE),\"\")","v":""}]
["","2018-04-12","Torsdag",null,0,0,{"$f":"IFERROR(VLOOKUP(B117,Helgdagar!A$2:C$24,3,FALSE),\"\")&\nIFERROR(VLOOKUP(B117,Helgdagar!E$2:G$24,3,FALSE),\"\")&\nIFERROR(VLOOKUP(B117,Helgdagar!I$2:K$24,3,FALSE),\"\")","v":""}]
["","2018-04-13","Fredag",null,0,0,{"$f":"IFERROR(VLOOKUP(B118,Helgdagar!A$2:C$24,3,FALSE),\"\")&\nIFERROR(VLOOKUP(B118,Helgdagar!E$2:G$24,3,FALSE),\"\")&\nIFERROR(VLOOKUP(B118,Helgdagar!I$2:K$24,3,FALSE),\"\")","v":""}]
["","2018-04-14","Lördag",null,0,0,{"$f":"IFERROR(VLOOKUP(B119,Helgdagar!A$2:C$24,3,FALSE),\"\")&\nIFERROR(VLOOKUP(B119,Helgdagar!E$2:G$24,3,FALSE),\"\")&\nIFERROR(VLOOKUP(B119,Helgdagar!I$2:K$24,3,FALSE),\"\")","v":""}]
["","2018-04-15","Söndag",null,0,0,{"$f":"IFERROR(VLOOKUP(B120,Helgdagar!A$2:C$24,3,FALSE),\"\")&\nIFERROR(VLOOKUP(B120,Helgdagar!E$2:G$24,3,FALSE),\"\")&\nIFERROR(VLOOKUP(B120,Helgdagar!I$2:K$24,3,FALSE),\"\")","v":""}]
["V. 16","2018-04-16","Måndag",null,0,0,{"$f":"IFERROR(VLOOKUP(B121,Helgdagar!A$2:C$24,3,FALSE),\"\")&\nIFERROR(VLOOKUP(B121,Helgdagar!E$2:G$24,3,FALSE),\"\")&\nIFERROR(VLOOKUP(B121,Helgdagar!I$2:K$24,3,FALSE),\"\")","v":""}]
["","2018-04-17","Tisdag",null,0,0,{"$f":"IFERROR(VLOOKUP(B122,Helgdagar!A$2:C$24,3,FALSE),\"\")&\nIFERROR(VLOOKUP(B122,Helgdagar!E$2:G$24,3,FALSE),\"\")&\nIFERROR(VLOOKUP(B122,Helgdagar!I$2:K$24,3,FALSE),\"\")","v":""}]
["","2018-04-18","Onsdag",null,0,0,{"$f":"IFERROR(VLOOKUP(B123,Helgdagar!A$2:C$24,3,FALSE),\"\")&\nIFERROR(VLOOKUP(B123,Helgdagar!E$2:G$24,3,FALSE),\"\")&\nIFERROR(VLOOKUP(B123,Helgdagar!I$2:K$24,3,FALSE),\"\")","v":""}]
["","2018-04-19","Torsdag",null,0,0,{"$f":"IFERROR(VLOOKUP(B124,Helgdagar!A$2:C$24,3,FALSE),\"\")&\nIFERROR(VLOOKUP(B124,Helgdagar!E$2:G$24,3,FALSE),\"\")&\nIFERROR(VLOOKUP(B124,Helgdagar!I$2:K$24,3,FALSE),\"\")","v":""}]
["","2018-04-20","Fredag",null,0,0,{"$f":"IFERROR(VLOOKUP(B125,Helgdagar!A$2:C$24,3,FALSE),\"\")&\nIFERROR(VLOOKUP(B125,Helgdagar!E$2:G$24,3,FALSE),\"\")&\nIFERROR(VLOOKUP(B125,Helgdagar!I$2:K$24,3,FALSE),\"\")","v":""}]
["","2018-04-21","Lördag",null,0,0,{"$f":"IFERROR(VLOOKUP(B126,Helgdagar!A$2:C$24,3,FALSE),\"\")&\nIFERROR(VLOOKUP(B126,Helgdagar!E$2:G$24,3,FALSE),\"\")&\nIFERROR(VLOOKUP(B126,Helgdagar!I$2:K$24,3,FALSE),\"\")","v":""}]
["","2018-04-22","Söndag",null,0,0,{"$f":"IFERROR(VLOOKUP(B127,Helgdagar!A$2:C$24,3,FALSE),\"\")&\nIFERROR(VLOOKUP(B127,Helgdagar!E$2:G$24,3,FALSE),\"\")&\nIFERROR(VLOOKUP(B127,Helgdagar!I$2:K$24,3,FALSE),\"\")","v":""}]
["V. 17","2018-04-23","Måndag",null,0,0,{"$f":"IFERROR(VLOOKUP(B128,Helgdagar!A$2:C$24,3,FALSE),\"\")&\nIFERROR(VLOOKUP(B128,Helgdagar!E$2:G$24,3,FALSE),\"\")&\nIFERROR(VLOOKUP(B128,Helgdagar!I$2:K$24,3,FALSE),\"\")","v":""}]
["","2018-04-24","Tisdag",null,0,0,{"$f":"IFERROR(VLOOKUP(B129,Helgdagar!A$2:C$24,3,FALSE),\"\")&\nIFERROR(VLOOKUP(B129,Helgdagar!E$2:G$24,3,FALSE),\"\")&\nIFERROR(VLOOKUP(B129,Helgdagar!I$2:K$24,3,FALSE),\"\")","v":""}]
["","2018-04-25","Onsdag",null,0,0,{"$f":"IFERROR(VLOOKUP(B130,Helgdagar!A$2:C$24,3,FALSE),\"\")&\nIFERROR(VLOOKUP(B130,Helgdagar!E$2:G$24,3,FALSE),\"\")&\nIFERROR(VLOOKUP(B130,Helgdagar!I$2:K$24,3,FALSE),\"\")","v":""}]
["","2018-04-26","Torsdag",null,0,0,{"$f":"IFERROR(VLOOKUP(B131,Helgdagar!A$2:C$24,3,FALSE),\"\")&\nIFERROR(VLOOKUP(B131,Helgdagar!E$2:G$24,3,FALSE),\"\")&\nIFERROR(VLOOKUP(B131,Helgdagar!I$2:K$24,3,FALSE),\"\")","v":""}]
["","2018-04-27","Fredag",null,0,0,{"$f":"IFERROR(VLOOKUP(B132,Helgdagar!A$2:C$24,3,FALSE),\"\")&\nIFERROR(VLOOKUP(B132,Helgdagar!E$2:G$24,3,FALSE),\"\")&\nIFERROR(VLOOKUP(B132,Helgdagar!I$2:K$24,3,FALSE),\"\")","v":""}]
["","2018-04-28","Lördag",null,0,0,{"$f":"IFERROR(VLOOKUP(B133,Helgdagar!A$2:C$24,3,FALSE),\"\")&\nIFERROR(VLOOKUP(B133,Helgdagar!E$2:G$24,3,FALSE),\"\")&\nIFERROR(VLOOKUP(B133,Helgdagar!I$2:K$24,3,FALSE),\"\")","v":""}]
["","2018-04-29","Söndag",null,0,0,{"$f":"IFERROR(VLOOKUP(B134,Helgdagar!A$2:C$24,3,FALSE),\"\")&\nIFERROR(VLOOKUP(B134,Helgdagar!E$2:G$24,3,FALSE),\"\")&\nIFERROR(VLOOKUP(B134,Helgdagar!I$2:K$24,3,FALSE),\"\")","v":""}]
["V. 18","2018-04-30","Måndag",null,0,0,{"$f":"IFERROR(VLOOKUP(B135,Helgdagar!A$2:C$24,3,FALSE),\"\")&\nIFERROR(VLOOKUP(B135,Helgdagar!E$2:G$24,3,FALSE),\"\")&\nIFERROR(VLOOKUP(B135,Helgdagar!I$2:K$24,3,FALSE),\"\")","v":"Valborgsmässafton"}]
["V. 18","2018-05-01","Tisdag",null,0,0,{"$f":"IFERROR(VLOOKUP(B136,Helgdagar!A$2:C$24,3,FALSE),\"\")&\nIFERROR(VLOOKUP(B136,Helgdagar!E$2:G$24,3,FALSE),\"\")&\nIFERROR(VLOOKUP(B136,Helgdagar!I$2:K$24,3,FALSE),\"\")","v":"Första maj"}]
["","2018-05-02","Onsdag",null,0,0,{"$f":"IFERROR(VLOOKUP(B137,Helgdagar!A$2:C$24,3,FALSE),\"\")&\nIFERROR(VLOOKUP(B137,Helgdagar!E$2:G$24,3,FALSE),\"\")&\nIFERROR(VLOOKUP(B137,Helgdagar!I$2:K$24,3,FALSE),\"\")","v":""}]
["","2018-05-03","Torsdag",null,0,0,{"$f":"IFERROR(VLOOKUP(B138,Helgdagar!A$2:C$24,3,FALSE),\"\")&\nIFERROR(VLOOKUP(B138,Helgdagar!E$2:G$24,3,FALSE),\"\")&\nIFERROR(VLOOKUP(B138,Helgdagar!I$2:K$24,3,FALSE),\"\")","v":""}]
["","2018-05-04","Fredag",null,0,0,{"$f":"IFERROR(VLOOKUP(B139,Helgdagar!A$2:C$24,3,FALSE),\"\")&\nIFERROR(VLOOKUP(B139,Helgdagar!E$2:G$24,3,FALSE),\"\")&\nIFERROR(VLOOKUP(B139,Helgdagar!I$2:K$24,3,FALSE),\"\")","v":""}]
["","2018-05-05","Lördag",null,0,0,{"$f":"IFERROR(VLOOKUP(B140,Helgdagar!A$2:C$24,3,FALSE),\"\")&\nIFERROR(VLOOKUP(B140,Helgdagar!E$2:G$24,3,FALSE),\"\")&\nIFERROR(VLOOKUP(B140,Helgdagar!I$2:K$24,3,FALSE),\"\")","v":""}]
["","2018-05-06","Söndag",null,0,0,{"$f":"IFERROR(VLOOKUP(B141,Helgdagar!A$2:C$24,3,FALSE),\"\")&\nIFERROR(VLOOKUP(B141,Helgdagar!E$2:G$24,3,FALSE),\"\")&\nIFERROR(VLOOKUP(B141,Helgdagar!I$2:K$24,3,FALSE),\"\")","v":""}]
["V. 19","2018-05-07","Måndag",null,0,0,{"$f":"IFERROR(VLOOKUP(B142,Helgdagar!A$2:C$24,3,FALSE),\"\")&\nIFERROR(VLOOKUP(B142,Helgdagar!E$2:G$24,3,FALSE),\"\")&\nIFERROR(VLOOKUP(B142,Helgdagar!I$2:K$24,3,FALSE),\"\")","v":""}]
["","2018-05-08","Tisdag",null,0,0,{"$f":"IFERROR(VLOOKUP(B143,Helgdagar!A$2:C$24,3,FALSE),\"\")&\nIFERROR(VLOOKUP(B143,Helgdagar!E$2:G$24,3,FALSE),\"\")&\nIFERROR(VLOOKUP(B143,Helgdagar!I$2:K$24,3,FALSE),\"\")","v":""}]
["","2018-05-09","Onsdag",null,{"$f":"IF(ISNUMBER(D144),IF($C$2,TEXT(TEXT(D144,\"00\\:00\"),\"[t]:mm\"),\n(TEXT(D144,\"00\\:00\"))*24),0)","v":0},{"$f":"IF(OR(ISNUMBER(D144),D144=\"F\",D144=\"EN\",D144=\"0-dag\",D144=\"FV\",D144=\"NK\"),TEXT(\nIF(OR(D144=\"F\",D144=\"EN\",D144=\"0-dag\",D144=\"NK\"),0,\nIF(D144=\"FV\",TEXT(Idealtid,\"00\\:00\"),\nIF(D144>Idealtid,(TEXT(D144,\"00\\:00\")-TEXT(Idealtid,\"00\\:00\")),(TEXT(Idealtid,\"00\\:00\")-TEXT(D144,\"00\\:00\")))))\n*IF($C$2,1,24),\nIF($C$2,\"[t]:mm\",\"0,0#\")),0)","v":0},{"$f":"IFERROR(VLOOKUP(B144,Helgdagar!A$2:C$24,3,FALSE),\"\")&\nIFERROR(VLOOKUP(B144,Helgdagar!E$2:G$24,3,FALSE),\"\")&\nIFERROR(VLOOKUP(B144,Helgdagar!I$2:K$24,3,FALSE),\"\")","v":""}]
[{"$f":"IF(OR(WEEKDAY(B145)=2,B145=DATE(YEAR(B145),MONTH(B145),1)),\"V. \"&WEEKNUM(B145,21),\"\")","v":""},"2018-05-10","Torsdag",null,0,0,{"$f":"IFERROR(VLOOKUP(B145,Helgdagar!A$2:C$24,3,FALSE),\"\")&\nIFERROR(VLOOKUP(B145,Helgdagar!E$2:G$24,3,FALSE),\"\")&\nIFERROR(VLOOKUP(B145,Helgdagar!I$2:K$24,3,FALSE),\"\")","v":"Kristi himmelfärdsdagen"}]
["",{"$f":"B145+1","v":"2018-05-11"},{"$f":"PROPER(TEXT(B146,\"dddd\"))","v":"Fredag"},null,0,0,{"$f":"IFERROR(VLOOKUP(B146,Helgdagar!A$2:C$24,3,FALSE),\"\")&\nIFERROR(VLOOKUP(B146,Helgdagar!E$2:G$24,3,FALSE),\"\")&\nIFERROR(VLOOKUP(B146,Helgdagar!I$2:K$24,3,FALSE),\"\")","v":""}]
["","2018-05-12","Lördag",null,0,0,{"$f":"IFERROR(VLOOKUP(B147,Helgdagar!A$2:C$24,3,FALSE),\"\")&\nIFERROR(VLOOKUP(B147,Helgdagar!E$2:G$24,3,FALSE),\"\")&\nIFERROR(VLOOKUP(B147,Helgdagar!I$2:K$24,3,FALSE),\"\")","v":""}]
["","2018-05-13","Söndag",null,0,0,{"$f":"IFERROR(VLOOKUP(B148,Helgdagar!A$2:C$24,3,FALSE),\"\")&\nIFERROR(VLOOKUP(B148,Helgdagar!E$2:G$24,3,FALSE),\"\")&\nIFERROR(VLOOKUP(B148,Helgdagar!I$2:K$24,3,FALSE),\"\")","v":""}]
["V. 20","2018-05-14","Måndag",null,0,0,{"$f":"IFERROR(VLOOKUP(B149,Helgdagar!A$2:C$24,3,FALSE),\"\")&\nIFERROR(VLOOKUP(B149,Helgdagar!E$2:G$24,3,FALSE),\"\")&\nIFERROR(VLOOKUP(B149,Helgdagar!I$2:K$24,3,FALSE),\"\")","v":""}]
["","2018-05-15","Tisdag",null,0,0,{"$f":"IFERROR(VLOOKUP(B150,Helgdagar!A$2:C$24,3,FALSE),\"\")&\nIFERROR(VLOOKUP(B150,Helgdagar!E$2:G$24,3,FALSE),\"\")&\nIFERROR(VLOOKUP(B150,Helgdagar!I$2:K$24,3,FALSE),\"\")","v":""}]
["","2018-05-16","Onsdag",null,0,0,{"$f":"IFERROR(VLOOKUP(B151,Helgdagar!A$2:C$24,3,FALSE),\"\")&\nIFERROR(VLOOKUP(B151,Helgdagar!E$2:G$24,3,FALSE),\"\")&\nIFERROR(VLOOKUP(B151,Helgdagar!I$2:K$24,3,FALSE),\"\")","v":""}]
["","2018-05-17","Torsdag",null,0,0,{"$f":"IFERROR(VLOOKUP(B152,Helgdagar!A$2:C$24,3,FALSE),\"\")&\nIFERROR(VLOOKUP(B152,Helgdagar!E$2:G$24,3,FALSE),\"\")&\nIFERROR(VLOOKUP(B152,Helgdagar!I$2:K$24,3,FALSE),\"\")","v":""}]
["","2018-05-18","Fredag",null,0,0,{"$f":"IFERROR(VLOOKUP(B153,Helgdagar!A$2:C$24,3,FALSE),\"\")&\nIFERROR(VLOOKUP(B153,Helgdagar!E$2:G$24,3,FALSE),\"\")&\nIFERROR(VLOOKUP(B153,Helgdagar!I$2:K$24,3,FALSE),\"\")","v":""}]
["","2018-05-19","Lördag",null,0,0,{"$f":"IFERROR(VLOOKUP(B154,Helgdagar!A$2:C$24,3,FALSE),\"\")&\nIFERROR(VLOOKUP(B154,Helgdagar!E$2:G$24,3,FALSE),\"\")&\nIFERROR(VLOOKUP(B154,Helgdagar!I$2:K$24,3,FALSE),\"\")","v":"Pingstafton"}]
["","2018-05-20","Söndag",null,0,0,{"$f":"IFERROR(VLOOKUP(B155,Helgdagar!A$2:C$24,3,FALSE),\"\")&\nIFERROR(VLOOKUP(B155,Helgdagar!E$2:G$24,3,FALSE),\"\")&\nIFERROR(VLOOKUP(B155,Helgdagar!I$2:K$24,3,FALSE),\"\")","v":"Pingstdagen"}]
["V. 21","2018-05-21","Måndag",null,0,0,{"$f":"IFERROR(VLOOKUP(B156,Helgdagar!A$2:C$24,3,FALSE),\"\")&\nIFERROR(VLOOKUP(B156,Helgdagar!E$2:G$24,3,FALSE),\"\")&\nIFERROR(VLOOKUP(B156,Helgdagar!I$2:K$24,3,FALSE),\"\")","v":""}]
["","2018-05-22","Tisdag",null,0,0,{"$f":"IFERROR(VLOOKUP(B157,Helgdagar!A$2:C$24,3,FALSE),\"\")&\nIFERROR(VLOOKUP(B157,Helgdagar!E$2:G$24,3,FALSE),\"\")&\nIFERROR(VLOOKUP(B157,Helgdagar!I$2:K$24,3,FALSE),\"\")","v":""}]
["","2018-05-23","Onsdag",null,0,0,{"$f":"IFERROR(VLOOKUP(B158,Helgdagar!A$2:C$24,3,FALSE),\"\")&\nIFERROR(VLOOKUP(B158,Helgdagar!E$2:G$24,3,FALSE),\"\")&\nIFERROR(VLOOKUP(B158,Helgdagar!I$2:K$24,3,FALSE),\"\")","v":""}]
["","2018-05-24","Torsdag",null,0,0,{"$f":"IFERROR(VLOOKUP(B159,Helgdagar!A$2:C$24,3,FALSE),\"\")&\nIFERROR(VLOOKUP(B159,Helgdagar!E$2:G$24,3,FALSE),\"\")&\nIFERROR(VLOOKUP(B159,Helgdagar!I$2:K$24,3,FALSE),\"\")","v":""}]
["","2018-05-25","Fredag",null,0,0,{"$f":"IFERROR(VLOOKUP(B160,Helgdagar!A$2:C$24,3,FALSE),\"\")&\nIFERROR(VLOOKUP(B160,Helgdagar!E$2:G$24,3,FALSE),\"\")&\nIFERROR(VLOOKUP(B160,Helgdagar!I$2:K$24,3,FALSE),\"\")","v":""}]
["","2018-05-26","Lördag",null,0,0,{"$f":"IFERROR(VLOOKUP(B161,Helgdagar!A$2:C$24,3,FALSE),\"\")&\nIFERROR(VLOOKUP(B161,Helgdagar!E$2:G$24,3,FALSE),\"\")&\nIFERROR(VLOOKUP(B161,Helgdagar!I$2:K$24,3,FALSE),\"\")","v":""}]
["","2018-05-27","Söndag",null,0,0,{"$f":"IFERROR(VLOOKUP(B162,Helgdagar!A$2:C$24,3,FALSE),\"\")&\nIFERROR(VLOOKUP(B162,Helgdagar!E$2:G$24,3,FALSE),\"\")&\nIFERROR(VLOOKUP(B162,Helgdagar!I$2:K$24,3,FALSE),\"\")","v":""}]
["V. 22","2018-05-28","Måndag",null,0,0,{"$f":"IFERROR(VLOOKUP(B163,Helgdagar!A$2:C$24,3,FALSE),\"\")&\nIFERROR(VLOOKUP(B163,Helgdagar!E$2:G$24,3,FALSE),\"\")&\nIFERROR(VLOOKUP(B163,Helgdagar!I$2:K$24,3,FALSE),\"\")","v":""}]
["","2018-05-29","Tisdag",null,0,0,{"$f":"IFERROR(VLOOKUP(B164,Helgdagar!A$2:C$24,3,FALSE),\"\")&\nIFERROR(VLOOKUP(B164,Helgdagar!E$2:G$24,3,FALSE),\"\")&\nIFERROR(VLOOKUP(B164,Helgdagar!I$2:K$24,3,FALSE),\"\")","v":""}]
["","2018-05-30","Onsdag",null,0,0,{"$f":"IFERROR(VLOOKUP(B165,Helgdagar!A$2:C$24,3,FALSE),\"\")&\nIFERROR(VLOOKUP(B165,Helgdagar!E$2:G$24,3,FALSE),\"\")&\nIFERROR(VLOOKUP(B165,Helgdagar!I$2:K$24,3,FALSE),\"\")","v":""}]
["","2018-05-31","Torsdag",null,0,0,{"$f":"IFERROR(VLOOKUP(B166,Helgdagar!A$2:C$24,3,FALSE),\"\")&\nIFERROR(VLOOKUP(B166,Helgdagar!E$2:G$24,3,FALSE),\"\")&\nIFERROR(VLOOKUP(B166,Helgdagar!I$2:K$24,3,FALSE),\"\")","v":""}]
["V. 22","2018-06-01","Fredag",null,0,0,{"$f":"IFERROR(VLOOKUP(B167,Helgdagar!A$2:C$24,3,FALSE),\"\")&\nIFERROR(VLOOKUP(B167,Helgdagar!E$2:G$24,3,FALSE),\"\")&\nIFERROR(VLOOKUP(B167,Helgdagar!I$2:K$24,3,FALSE),\"\")","v":""}]
["","2018-06-02","Lördag",null,0,0,{"$f":"IFERROR(VLOOKUP(B168,Helgdagar!A$2:C$24,3,FALSE),\"\")&\nIFERROR(VLOOKUP(B168,Helgdagar!E$2:G$24,3,FALSE),\"\")&\nIFERROR(VLOOKUP(B168,Helgdagar!I$2:K$24,3,FALSE),\"\")","v":""}]
["","2018-06-03","Söndag",null,0,0,{"$f":"IFERROR(VLOOKUP(B169,Helgdagar!A$2:C$24,3,FALSE),\"\")&\nIFERROR(VLOOKUP(B169,Helgdagar!E$2:G$24,3,FALSE),\"\")&\nIFERROR(VLOOKUP(B169,Helgdagar!I$2:K$24,3,FALSE),\"\")","v":""}]
["V. 23","2018-06-04","Måndag",null,0,0,{"$f":"IFERROR(VLOOKUP(B170,Helgdagar!A$2:C$24,3,FALSE),\"\")&\nIFERROR(VLOOKUP(B170,Helgdagar!E$2:G$24,3,FALSE),\"\")&\nIFERROR(VLOOKUP(B170,Helgdagar!I$2:K$24,3,FALSE),\"\")","v":""}]
["","2018-06-05","Tisdag",null,0,0,{"$f":"IFERROR(VLOOKUP(B171,Helgdagar!A$2:C$24,3,FALSE),\"\")&\nIFERROR(VLOOKUP(B171,Helgdagar!E$2:G$24,3,FALSE),\"\")&\nIFERROR(VLOOKUP(B171,Helgdagar!I$2:K$24,3,FALSE),\"\")","v":""}]
["","2018-06-06","Onsdag",null,0,0,{"$f":"IFERROR(VLOOKUP(B172,Helgdagar!A$2:C$24,3,FALSE),\"\")&\nIFERROR(VLOOKUP(B172,Helgdagar!E$2:G$24,3,FALSE),\"\")&\nIFERROR(VLOOKUP(B172,Helgdagar!I$2:K$24,3,FALSE),\"\")","v":"Sveriges nationaldag"}]
["","2018-06-07","Torsdag",null,0,0,{"$f":"IFERROR(VLOOKUP(B173,Helgdagar!A$2:C$24,3,FALSE),\"\")&\nIFERROR(VLOOKUP(B173,Helgdagar!E$2:G$24,3,FALSE),\"\")&\nIFERROR(VLOOKUP(B173,Helgdagar!I$2:K$24,3,FALSE),\"\")","v":""}]
["","2018-06-08","Fredag",null,0,0,{"$f":"IFERROR(VLOOKUP(B174,Helgdagar!A$2:C$24,3,FALSE),\"\")&\nIFERROR(VLOOKUP(B174,Helgdagar!E$2:G$24,3,FALSE),\"\")&\nIFERROR(VLOOKUP(B174,Helgdagar!I$2:K$24,3,FALSE),\"\")","v":""}]
["","2018-06-09","Lördag",null,0,0,{"$f":"IFERROR(VLOOKUP(B175,Helgdagar!A$2:C$24,3,FALSE),\"\")&\nIFERROR(VLOOKUP(B175,Helgdagar!E$2:G$24,3,FALSE),\"\")&\nIFERROR(VLOOKUP(B175,Helgdagar!I$2:K$24,3,FALSE),\"\")","v":""}]
["","2018-06-10","Söndag",null,0,0,{"$f":"IFERROR(VLOOKUP(B176,Helgdagar!A$2:C$24,3,FALSE),\"\")&\nIFERROR(VLOOKUP(B176,Helgdagar!E$2:G$24,3,FALSE),\"\")&\nIFERROR(VLOOKUP(B176,Helgdagar!I$2:K$24,3,FALSE),\"\")","v":""}]
["V. 24","2018-06-11","Måndag",null,0,0,{"$f":"IFERROR(VLOOKUP(B177,Helgdagar!A$2:C$24,3,FALSE),\"\")&\nIFERROR(VLOOKUP(B177,Helgdagar!E$2:G$24,3,FALSE),\"\")&\nIFERROR(VLOOKUP(B177,Helgdagar!I$2:K$24,3,FALSE),\"\")","v":""}]
["","2018-06-12","Tisdag",null,0,0,{"$f":"IFERROR(VLOOKUP(B178,Helgdagar!A$2:C$24,3,FALSE),\"\")&\nIFERROR(VLOOKUP(B178,Helgdagar!E$2:G$24,3,FALSE),\"\")&\nIFERROR(VLOOKUP(B178,Helgdagar!I$2:K$24,3,FALSE),\"\")","v":""}]
["","2018-06-13","Onsdag",null,0,0,{"$f":"IFERROR(VLOOKUP(B179,Helgdagar!A$2:C$24,3,FALSE),\"\")&\nIFERROR(VLOOKUP(B179,Helgdagar!E$2:G$24,3,FALSE),\"\")&\nIFERROR(VLOOKUP(B179,Helgdagar!I$2:K$24,3,FALSE),\"\")","v":""}]
["","2018-06-14","Torsdag",null,0,0,{"$f":"IFERROR(VLOOKUP(B180,Helgdagar!A$2:C$24,3,FALSE),\"\")&\nIFERROR(VLOOKUP(B180,Helgdagar!E$2:G$24,3,FALSE),\"\")&\nIFERROR(VLOOKUP(B180,Helgdagar!I$2:K$24,3,FALSE),\"\")","v":""}]
["","2018-06-15","Fredag",null,0,0,{"$f":"IFERROR(VLOOKUP(B181,Helgdagar!A$2:C$24,3,FALSE),\"\")&\nIFERROR(VLOOKUP(B181,Helgdagar!E$2:G$24,3,FALSE),\"\")&\nIFERROR(VLOOKUP(B181,Helgdagar!I$2:K$24,3,FALSE),\"\")","v":""}]
["","2018-06-16","Lördag",null,0,0,{"$f":"IFERROR(VLOOKUP(B182,Helgdagar!A$2:C$24,3,FALSE),\"\")&\nIFERROR(VLOOKUP(B182,Helgdagar!E$2:G$24,3,FALSE),\"\")&\nIFERROR(VLOOKUP(B182,Helgdagar!I$2:K$24,3,FALSE),\"\")","v":""}]
["","2018-06-17","Söndag",null,0,0,{"$f":"IFERROR(VLOOKUP(B183,Helgdagar!A$2:C$24,3,FALSE),\"\")&\nIFERROR(VLOOKUP(B183,Helgdagar!E$2:G$24,3,FALSE),\"\")&\nIFERROR(VLOOKUP(B183,Helgdagar!I$2:K$24,3,FALSE),\"\")","v":""}]
["V. 25","2018-06-18","Måndag",null,0,0,{"$f":"IFERROR(VLOOKUP(B184,Helgdagar!A$2:C$24,3,FALSE),\"\")&\nIFERROR(VLOOKUP(B184,Helgdagar!E$2:G$24,3,FALSE),\"\")&\nIFERROR(VLOOKUP(B184,Helgdagar!I$2:K$24,3,FALSE),\"\")","v":""}]
["","2018-06-19","Tisdag",null,0,0,{"$f":"IFERROR(VLOOKUP(B185,Helgdagar!A$2:C$24,3,FALSE),\"\")&\nIFERROR(VLOOKUP(B185,Helgdagar!E$2:G$24,3,FALSE),\"\")&\nIFERROR(VLOOKUP(B185,Helgdagar!I$2:K$24,3,FALSE),\"\")","v":""}]
["","2018-06-20","Onsdag",null,0,0,{"$f":"IFERROR(VLOOKUP(B186,Helgdagar!A$2:C$24,3,FALSE),\"\")&\nIFERROR(VLOOKUP(B186,Helgdagar!E$2:G$24,3,FALSE),\"\")&\nIFERROR(VLOOKUP(B186,Helgdagar!I$2:K$24,3,FALSE),\"\")","v":""}]
["","2018-06-21","Torsdag",null,0,0,{"$f":"IFERROR(VLOOKUP(B187,Helgdagar!A$2:C$24,3,FALSE),\"\")&\nIFERROR(VLOOKUP(B187,Helgdagar!E$2:G$24,3,FALSE),\"\")&\nIFERROR(VLOOKUP(B187,Helgdagar!I$2:K$24,3,FALSE),\"\")","v":""}]
["","2018-06-22","Fredag",null,0,0,{"$f":"IFERROR(VLOOKUP(B188,Helgdagar!A$2:C$24,3,FALSE),\"\")&\nIFERROR(VLOOKUP(B188,Helgdagar!E$2:G$24,3,FALSE),\"\")&\nIFERROR(VLOOKUP(B188,Helgdagar!I$2:K$24,3,FALSE),\"\")","v":"Midsommarafton"}]
["","2018-06-23","Lördag",null,0,0,{"$f":"IFERROR(VLOOKUP(B189,Helgdagar!A$2:C$24,3,FALSE),\"\")&\nIFERROR(VLOOKUP(B189,Helgdagar!E$2:G$24,3,FALSE),\"\")&\nIFERROR(VLOOKUP(B189,Helgdagar!I$2:K$24,3,FALSE),\"\")","v":"Midsommardagen"}]
["","2018-06-24","Söndag",null,0,0,{"$f":"IFERROR(VLOOKUP(B190,Helgdagar!A$2:C$24,3,FALSE),\"\")&\nIFERROR(VLOOKUP(B190,Helgdagar!E$2:G$24,3,FALSE),\"\")&\nIFERROR(VLOOKUP(B190,Helgdagar!I$2:K$24,3,FALSE),\"\")","v":""}]
["V. 26","2018-06-25","Måndag",null,0,0,{"$f":"IFERROR(VLOOKUP(B191,Helgdagar!A$2:C$24,3,FALSE),\"\")&\nIFERROR(VLOOKUP(B191,Helgdagar!E$2:G$24,3,FALSE),\"\")&\nIFERROR(VLOOKUP(B191,Helgdagar!I$2:K$24,3,FALSE),\"\")","v":""}]
["","2018-06-26","Tisdag",null,0,0,{"$f":"IFERROR(VLOOKUP(B192,Helgdagar!A$2:C$24,3,FALSE),\"\")&\nIFERROR(VLOOKUP(B192,Helgdagar!E$2:G$24,3,FALSE),\"\")&\nIFERROR(VLOOKUP(B192,Helgdagar!I$2:K$24,3,FALSE),\"\")","v":""}]
["","2018-06-27","Onsdag",null,0,0,{"$f":"IFERROR(VLOOKUP(B193,Helgdagar!A$2:C$24,3,FALSE),\"\")&\nIFERROR(VLOOKUP(B193,Helgdagar!E$2:G$24,3,FALSE),\"\")&\nIFERROR(VLOOKUP(B193,Helgdagar!I$2:K$24,3,FALSE),\"\")","v":""}]
["","2018-06-28","Torsdag",null,0,0,{"$f":"IFERROR(VLOOKUP(B194,Helgdagar!A$2:C$24,3,FALSE),\"\")&\nIFERROR(VLOOKUP(B194,Helgdagar!E$2:G$24,3,FALSE),\"\")&\nIFERROR(VLOOKUP(B194,Helgdagar!I$2:K$24,3,FALSE),\"\")","v":""}]
["","2018-06-29","Fredag",null,0,0,{"$f":"IFERROR(VLOOKUP(B195,Helgdagar!A$2:C$24,3,FALSE),\"\")&\nIFERROR(VLOOKUP(B195,Helgdagar!E$2:G$24,3,FALSE),\"\")&\nIFERROR(VLOOKUP(B195,Helgdagar!I$2:K$24,3,FALSE),\"\")","v":""}]
["","2018-06-30","Lördag",null,0,0,{"$f":"IFERROR(VLOOKUP(B196,Helgdagar!A$2:C$24,3,FALSE),\"\")&\nIFERROR(VLOOKUP(B196,Helgdagar!E$2:G$24,3,FALSE),\"\")&\nIFERROR(VLOOKUP(B196,Helgdagar!I$2:K$24,3,FALSE),\"\")","v":""}]
["V. 26","2018-07-01","Söndag",null,0,0,{"$f":"IFERROR(VLOOKUP(B197,Helgdagar!A$2:C$24,3,FALSE),\"\")&\nIFERROR(VLOOKUP(B197,Helgdagar!E$2:G$24,3,FALSE),\"\")&\nIFERROR(VLOOKUP(B197,Helgdagar!I$2:K$24,3,FALSE),\"\")","v":""}]
["V. 27","2018-07-02","Måndag",null,0,0,{"$f":"IFERROR(VLOOKUP(B198,Helgdagar!A$2:C$24,3,FALSE),\"\")&\nIFERROR(VLOOKUP(B198,Helgdagar!E$2:G$24,3,FALSE),\"\")&\nIFERROR(VLOOKUP(B198,Helgdagar!I$2:K$24,3,FALSE),\"\")","v":""}]
["","2018-07-03","Tisdag",null,0,0,{"$f":"IFERROR(VLOOKUP(B199,Helgdagar!A$2:C$24,3,FALSE),\"\")&\nIFERROR(VLOOKUP(B199,Helgdagar!E$2:G$24,3,FALSE),\"\")&\nIFERROR(VLOOKUP(B199,Helgdagar!I$2:K$24,3,FALSE),\"\")","v":""}]
["","2018-07-04","Onsdag",null,0,0,{"$f":"IFERROR(VLOOKUP(B200,Helgdagar!A$2:C$24,3,FALSE),\"\")&\nIFERROR(VLOOKUP(B200,Helgdagar!E$2:G$24,3,FALSE),\"\")&\nIFERROR(VLOOKUP(B200,Helgdagar!I$2:K$24,3,FALSE),\"\")","v":""}]
["","2018-07-05","Torsdag",null,0,0,{"$f":"IFERROR(VLOOKUP(B201,Helgdagar!A$2:C$24,3,FALSE),\"\")&\nIFERROR(VLOOKUP(B201,Helgdagar!E$2:G$24,3,FALSE),\"\")&\nIFERROR(VLOOKUP(B201,Helgdagar!I$2:K$24,3,FALSE),\"\")","v":""}]
["","2018-07-06","Fredag",null,0,0,{"$f":"IFERROR(VLOOKUP(B202,Helgdagar!A$2:C$24,3,FALSE),\"\")&\nIFERROR(VLOOKUP(B202,Helgdagar!E$2:G$24,3,FALSE),\"\")&\nIFERROR(VLOOKUP(B202,Helgdagar!I$2:K$24,3,FALSE),\"\")","v":""}]
["","2018-07-07","Lördag",null,0,0,{"$f":"IFERROR(VLOOKUP(B203,Helgdagar!A$2:C$24,3,FALSE),\"\")&\nIFERROR(VLOOKUP(B203,Helgdagar!E$2:G$24,3,FALSE),\"\")&\nIFERROR(VLOOKUP(B203,Helgdagar!I$2:K$24,3,FALSE),\"\")","v":""}]
["","2018-07-08","Söndag",null,0,0,{"$f":"IFERROR(VLOOKUP(B204,Helgdagar!A$2:C$24,3,FALSE),\"\")&\nIFERROR(VLOOKUP(B204,Helgdagar!E$2:G$24,3,FALSE),\"\")&\nIFERROR(VLOOKUP(B204,Helgdagar!I$2:K$24,3,FALSE),\"\")","v":""}]
["V. 28","2018-07-09","Måndag",null,0,0,{"$f":"IFERROR(VLOOKUP(B205,Helgdagar!A$2:C$24,3,FALSE),\"\")&\nIFERROR(VLOOKUP(B205,Helgdagar!E$2:G$24,3,FALSE),\"\")&\nIFERROR(VLOOKUP(B205,Helgdagar!I$2:K$24,3,FALSE),\"\")","v":""}]
["","2018-07-10","Tisdag",null,0,0,{"$f":"IFERROR(VLOOKUP(B206,Helgdagar!A$2:C$24,3,FALSE),\"\")&\nIFERROR(VLOOKUP(B206,Helgdagar!E$2:G$24,3,FALSE),\"\")&\nIFERROR(VLOOKUP(B206,Helgdagar!I$2:K$24,3,FALSE),\"\")","v":""}]
["","2018-07-11","Onsdag",null,0,0,{"$f":"IFERROR(VLOOKUP(B207,Helgdagar!A$2:C$24,3,FALSE),\"\")&\nIFERROR(VLOOKUP(B207,Helgdagar!E$2:G$24,3,FALSE),\"\")&\nIFERROR(VLOOKUP(B207,Helgdagar!I$2:K$24,3,FALSE),\"\")","v":""}]
["","2018-07-12","Torsdag",null,{"$f":"IF(ISNUMBER(D208),IF($C$2,TEXT(TEXT(D208,\"00\\:00\"),\"[t]:mm\"),\n(TEXT(D208,\"00\\:00\"))*24),0)","v":0},{"$f":"IF(OR(ISNUMBER(D208),D208=\"F\",D208=\"EN\",D208=\"0-dag\",D208=\"FV\",D208=\"NK\"),TEXT(\nIF(OR(D208=\"F\",D208=\"EN\",D208=\"0-dag\",D208=\"NK\"),0,\nIF(D208=\"FV\",TEXT(Idealtid,\"00\\:00\"),\nIF(D208>Idealtid,(TEXT(D208,\"00\\:00\")-TEXT(Idealtid,\"00\\:00\")),(TEXT(Idealtid,\"00\\:00\")-TEXT(D208,\"00\\:00\")))))\n*IF($C$2,1,24),\nIF($C$2,\"[t]:mm\",\"0,0#\")),0)","v":0},{"$f":"IFERROR(VLOOKUP(B208,Helgdagar!A$2:C$24,3,FALSE),\"\")&\nIFERROR(VLOOKUP(B208,Helgdagar!E$2:G$24,3,FALSE),\"\")&\nIFERROR(VLOOKUP(B208,Helgdagar!I$2:K$24,3,FALSE),\"\")","v":""}]
[{"$f":"IF(OR(WEEKDAY(B209)=2,B209=DATE(YEAR(B209),MONTH(B209),1)),\"V. \"&WEEKNUM(B209,21),\"\")","v":""},"2018-07-13","Fredag",null,0,0,{"$f":"IFERROR(VLOOKUP(B209,Helgdagar!A$2:C$24,3,FALSE),\"\")&\nIFERROR(VLOOKUP(B209,Helgdagar!E$2:G$24,3,FALSE),\"\")&\nIFERROR(VLOOKUP(B209,Helgdagar!I$2:K$24,3,FALSE),\"\")","v":""}]
["",{"$f":"B209+1","v":"2018-07-14"},{"$f":"PROPER(TEXT(B210,\"dddd\"))","v":"Lördag"},null,0,0,{"$f":"IFERROR(VLOOKUP(B210,Helgdagar!A$2:C$24,3,FALSE),\"\")&\nIFERROR(VLOOKUP(B210,Helgdagar!E$2:G$24,3,FALSE),\"\")&\nIFERROR(VLOOKUP(B210,Helgdagar!I$2:K$24,3,FALSE),\"\")","v":""}]
["","2018-07-15","Söndag",null,0,0,{"$f":"IFERROR(VLOOKUP(B211,Helgdagar!A$2:C$24,3,FALSE),\"\")&\nIFERROR(VLOOKUP(B211,Helgdagar!E$2:G$24,3,FALSE),\"\")&\nIFERROR(VLOOKUP(B211,Helgdagar!I$2:K$24,3,FALSE),\"\")","v":""}]
["V. 29","2018-07-16","Måndag",null,0,0,{"$f":"IFERROR(VLOOKUP(B212,Helgdagar!A$2:C$24,3,FALSE),\"\")&\nIFERROR(VLOOKUP(B212,Helgdagar!E$2:G$24,3,FALSE),\"\")&\nIFERROR(VLOOKUP(B212,Helgdagar!I$2:K$24,3,FALSE),\"\")","v":""}]
["","2018-07-17","Tisdag",null,0,0,{"$f":"IFERROR(VLOOKUP(B213,Helgdagar!A$2:C$24,3,FALSE),\"\")&\nIFERROR(VLOOKUP(B213,Helgdagar!E$2:G$24,3,FALSE),\"\")&\nIFERROR(VLOOKUP(B213,Helgdagar!I$2:K$24,3,FALSE),\"\")","v":""}]
["","2018-07-18","Onsdag",null,0,0,{"$f":"IFERROR(VLOOKUP(B214,Helgdagar!A$2:C$24,3,FALSE),\"\")&\nIFERROR(VLOOKUP(B214,Helgdagar!E$2:G$24,3,FALSE),\"\")&\nIFERROR(VLOOKUP(B214,Helgdagar!I$2:K$24,3,FALSE),\"\")","v":""}]
["","2018-07-19","Torsdag",null,0,0,{"$f":"IFERROR(VLOOKUP(B215,Helgdagar!A$2:C$24,3,FALSE),\"\")&\nIFERROR(VLOOKUP(B215,Helgdagar!E$2:G$24,3,FALSE),\"\")&\nIFERROR(VLOOKUP(B215,Helgdagar!I$2:K$24,3,FALSE),\"\")","v":""}]
["","2018-07-20","Fredag",null,0,0,{"$f":"IFERROR(VLOOKUP(B216,Helgdagar!A$2:C$24,3,FALSE),\"\")&\nIFERROR(VLOOKUP(B216,Helgdagar!E$2:G$24,3,FALSE),\"\")&\nIFERROR(VLOOKUP(B216,Helgdagar!I$2:K$24,3,FALSE),\"\")","v":""}]
["","2018-07-21","Lördag",null,0,0,{"$f":"IFERROR(VLOOKUP(B217,Helgdagar!A$2:C$24,3,FALSE),\"\")&\nIFERROR(VLOOKUP(B217,Helgdagar!E$2:G$24,3,FALSE),\"\")&\nIFERROR(VLOOKUP(B217,Helgdagar!I$2:K$24,3,FALSE),\"\")","v":""}]
["","2018-07-22","Söndag",null,0,0,{"$f":"IFERROR(VLOOKUP(B218,Helgdagar!A$2:C$24,3,FALSE),\"\")&\nIFERROR(VLOOKUP(B218,Helgdagar!E$2:G$24,3,FALSE),\"\")&\nIFERROR(VLOOKUP(B218,Helgdagar!I$2:K$24,3,FALSE),\"\")","v":""}]
["V. 30","2018-07-23","Måndag",null,0,0,{"$f":"IFERROR(VLOOKUP(B219,Helgdagar!A$2:C$24,3,FALSE),\"\")&\nIFERROR(VLOOKUP(B219,Helgdagar!E$2:G$24,3,FALSE),\"\")&\nIFERROR(VLOOKUP(B219,Helgdagar!I$2:K$24,3,FALSE),\"\")","v":""}]
["","2018-07-24","Tisdag",null,0,0,{"$f":"IFERROR(VLOOKUP(B220,Helgdagar!A$2:C$24,3,FALSE),\"\")&\nIFERROR(VLOOKUP(B220,Helgdagar!E$2:G$24,3,FALSE),\"\")&\nIFERROR(VLOOKUP(B220,Helgdagar!I$2:K$24,3,FALSE),\"\")","v":""}]
["","2018-07-25","Onsdag",null,0,0,{"$f":"IFERROR(VLOOKUP(B221,Helgdagar!A$2:C$24,3,FALSE),\"\")&\nIFERROR(VLOOKUP(B221,Helgdagar!E$2:G$24,3,FALSE),\"\")&\nIFERROR(VLOOKUP(B221,Helgdagar!I$2:K$24,3,FALSE),\"\")","v":""}]
["","2018-07-26","Torsdag",null,0,0,{"$f":"IFERROR(VLOOKUP(B222,Helgdagar!A$2:C$24,3,FALSE),\"\")&\nIFERROR(VLOOKUP(B222,Helgdagar!E$2:G$24,3,FALSE),\"\")&\nIFERROR(VLOOKUP(B222,Helgdagar!I$2:K$24,3,FALSE),\"\")","v":""}]
["","2018-07-27","Fredag",null,0,0,{"$f":"IFERROR(VLOOKUP(B223,Helgdagar!A$2:C$24,3,FALSE),\"\")&\nIFERROR(VLOOKUP(B223,Helgdagar!E$2:G$24,3,FALSE),\"\")&\nIFERROR(VLOOKUP(B223,Helgdagar!I$2:K$24,3,FALSE),\"\")","v":""}]
["","2018-07-28","Lördag",null,0,0,{"$f":"IFERROR(VLOOKUP(B224,Helgdagar!A$2:C$24,3,FALSE),\"\")&\nIFERROR(VLOOKUP(B224,Helgdagar!E$2:G$24,3,FALSE),\"\")&\nIFERROR(VLOOKUP(B224,Helgdagar!I$2:K$24,3,FALSE),\"\")","v":""}]
["","2018-07-29","Söndag",null,0,0,{"$f":"IFERROR(VLOOKUP(B225,Helgdagar!A$2:C$24,3,FALSE),\"\")&\nIFERROR(VLOOKUP(B225,Helgdagar!E$2:G$24,3,FALSE),\"\")&\nIFERROR(VLOOKUP(B225,Helgdagar!I$2:K$24,3,FALSE),\"\")","v":""}]
["V. 31","2018-07-30","Måndag",null,0,0,{"$f":"IFERROR(VLOOKUP(B226,Helgdagar!A$2:C$24,3,FALSE),\"\")&\nIFERROR(VLOOKUP(B226,Helgdagar!E$2:G$24,3,FALSE),\"\")&\nIFERROR(VLOOKUP(B226,Helgdagar!I$2:K$24,3,FALSE),\"\")","v":""}]
["","2018-07-31","Tisdag",null,0,0,{"$f":"IFERROR(VLOOKUP(B227,Helgdagar!A$2:C$24,3,FALSE),\"\")&\nIFERROR(VLOOKUP(B227,Helgdagar!E$2:G$24,3,FALSE),\"\")&\nIFERROR(VLOOKUP(B227,Helgdagar!I$2:K$24,3,FALSE),\"\")","v":""}]
["V. 31","2018-08-01","Onsdag",null,0,0,{"$f":"IFERROR(VLOOKUP(B228,Helgdagar!A$2:C$24,3,FALSE),\"\")&\nIFERROR(VLOOKUP(B228,Helgdagar!E$2:G$24,3,FALSE),\"\")&\nIFERROR(VLOOKUP(B228,Helgdagar!I$2:K$24,3,FALSE),\"\")","v":""}]
["","2018-08-02","Torsdag",null,0,0,{"$f":"IFERROR(VLOOKUP(B229,Helgdagar!A$2:C$24,3,FALSE),\"\")&\nIFERROR(VLOOKUP(B229,Helgdagar!E$2:G$24,3,FALSE),\"\")&\nIFERROR(VLOOKUP(B229,Helgdagar!I$2:K$24,3,FALSE),\"\")","v":""}]
["","2018-08-03","Fredag",null,0,0,{"$f":"IFERROR(VLOOKUP(B230,Helgdagar!A$2:C$24,3,FALSE),\"\")&\nIFERROR(VLOOKUP(B230,Helgdagar!E$2:G$24,3,FALSE),\"\")&\nIFERROR(VLOOKUP(B230,Helgdagar!I$2:K$24,3,FALSE),\"\")","v":""}]
["","2018-08-04","Lördag",null,0,0,{"$f":"IFERROR(VLOOKUP(B231,Helgdagar!A$2:C$24,3,FALSE),\"\")&\nIFERROR(VLOOKUP(B231,Helgdagar!E$2:G$24,3,FALSE),\"\")&\nIFERROR(VLOOKUP(B231,Helgdagar!I$2:K$24,3,FALSE),\"\")","v":""}]
["","2018-08-05","Söndag",null,0,0,{"$f":"IFERROR(VLOOKUP(B232,Helgdagar!A$2:C$24,3,FALSE),\"\")&\nIFERROR(VLOOKUP(B232,Helgdagar!E$2:G$24,3,FALSE),\"\")&\nIFERROR(VLOOKUP(B232,Helgdagar!I$2:K$24,3,FALSE),\"\")","v":""}]
["V. 32","2018-08-06","Måndag",null,0,0,{"$f":"IFERROR(VLOOKUP(B233,Helgdagar!A$2:C$24,3,FALSE),\"\")&\nIFERROR(VLOOKUP(B233,Helgdagar!E$2:G$24,3,FALSE),\"\")&\nIFERROR(VLOOKUP(B233,Helgdagar!I$2:K$24,3,FALSE),\"\")","v":""}]
["","2018-08-07","Tisdag",null,0,0,{"$f":"IFERROR(VLOOKUP(B234,Helgdagar!A$2:C$24,3,FALSE),\"\")&\nIFERROR(VLOOKUP(B234,Helgdagar!E$2:G$24,3,FALSE),\"\")&\nIFERROR(VLOOKUP(B234,Helgdagar!I$2:K$24,3,FALSE),\"\")","v":""}]
["","2018-08-08","Onsdag",null,0,0,{"$f":"IFERROR(VLOOKUP(B235,Helgdagar!A$2:C$24,3,FALSE),\"\")&\nIFERROR(VLOOKUP(B235,Helgdagar!E$2:G$24,3,FALSE),\"\")&\nIFERROR(VLOOKUP(B235,Helgdagar!I$2:K$24,3,FALSE),\"\")","v":""}]
["","2018-08-09","Torsdag",null,0,0,{"$f":"IFERROR(VLOOKUP(B236,Helgdagar!A$2:C$24,3,FALSE),\"\")&\nIFERROR(VLOOKUP(B236,Helgdagar!E$2:G$24,3,FALSE),\"\")&\nIFERROR(VLOOKUP(B236,Helgdagar!I$2:K$24,3,FALSE),\"\")","v":""}]
["","2018-08-10","Fredag",null,0,0,{"$f":"IFERROR(VLOOKUP(B237,Helgdagar!A$2:C$24,3,FALSE),\"\")&\nIFERROR(VLOOKUP(B237,Helgdagar!E$2:G$24,3,FALSE),\"\")&\nIFERROR(VLOOKUP(B237,Helgdagar!I$2:K$24,3,FALSE),\"\")","v":""}]
["","2018-08-11","Lördag",null,0,0,{"$f":"IFERROR(VLOOKUP(B238,Helgdagar!A$2:C$24,3,FALSE),\"\")&\nIFERROR(VLOOKUP(B238,Helgdagar!E$2:G$24,3,FALSE),\"\")&\nIFERROR(VLOOKUP(B238,Helgdagar!I$2:K$24,3,FALSE),\"\")","v":""}]
["","2018-08-12","Söndag",null,0,0,{"$f":"IFERROR(VLOOKUP(B239,Helgdagar!A$2:C$24,3,FALSE),\"\")&\nIFERROR(VLOOKUP(B239,Helgdagar!E$2:G$24,3,FALSE),\"\")&\nIFERROR(VLOOKUP(B239,Helgdagar!I$2:K$24,3,FALSE),\"\")","v":""}]
["V. 33","2018-08-13","Måndag",null,0,0,{"$f":"IFERROR(VLOOKUP(B240,Helgdagar!A$2:C$24,3,FALSE),\"\")&\nIFERROR(VLOOKUP(B240,Helgdagar!E$2:G$24,3,FALSE),\"\")&\nIFERROR(VLOOKUP(B240,Helgdagar!I$2:K$24,3,FALSE),\"\")","v":""}]
["","2018-08-14","Tisdag",null,0,0,{"$f":"IFERROR(VLOOKUP(B241,Helgdagar!A$2:C$24,3,FALSE),\"\")&\nIFERROR(VLOOKUP(B241,Helgdagar!E$2:G$24,3,FALSE),\"\")&\nIFERROR(VLOOKUP(B241,Helgdagar!I$2:K$24,3,FALSE),\"\")","v":""}]
["","2018-08-15","Onsdag",null,0,0,{"$f":"IFERROR(VLOOKUP(B242,Helgdagar!A$2:C$24,3,FALSE),\"\")&\nIFERROR(VLOOKUP(B242,Helgdagar!E$2:G$24,3,FALSE),\"\")&\nIFERROR(VLOOKUP(B242,Helgdagar!I$2:K$24,3,FALSE),\"\")","v":""}]
["","2018-08-16","Torsdag",null,0,0,{"$f":"IFERROR(VLOOKUP(B243,Helgdagar!A$2:C$24,3,FALSE),\"\")&\nIFERROR(VLOOKUP(B243,Helgdagar!E$2:G$24,3,FALSE),\"\")&\nIFERROR(VLOOKUP(B243,Helgdagar!I$2:K$24,3,FALSE),\"\")","v":""}]
["","2018-08-17","Fredag",null,0,0,{"$f":"IFERROR(VLOOKUP(B244,Helgdagar!A$2:C$24,3,FALSE),\"\")&\nIFERROR(VLOOKUP(B244,Helgdagar!E$2:G$24,3,FALSE),\"\")&\nIFERROR(VLOOKUP(B244,Helgdagar!I$2:K$24,3,FALSE),\"\")","v":""}]
["","2018-08-18","Lördag",null,0,0,{"$f":"IFERROR(VLOOKUP(B245,Helgdagar!A$2:C$24,3,FALSE),\"\")&\nIFERROR(VLOOKUP(B245,Helgdagar!E$2:G$24,3,FALSE),\"\")&\nIFERROR(VLOOKUP(B245,Helgdagar!I$2:K$24,3,FALSE),\"\")","v":""}]
["","2018-08-19","Söndag",null,0,0,{"$f":"IFERROR(VLOOKUP(B246,Helgdagar!A$2:C$24,3,FALSE),\"\")&\nIFERROR(VLOOKUP(B246,Helgdagar!E$2:G$24,3,FALSE),\"\")&\nIFERROR(VLOOKUP(B246,Helgdagar!I$2:K$24,3,FALSE),\"\")","v":""}]
["V. 34","2018-08-20","Måndag",null,0,0,{"$f":"IFERROR(VLOOKUP(B247,Helgdagar!A$2:C$24,3,FALSE),\"\")&\nIFERROR(VLOOKUP(B247,Helgdagar!E$2:G$24,3,FALSE),\"\")&\nIFERROR(VLOOKUP(B247,Helgdagar!I$2:K$24,3,FALSE),\"\")","v":""}]
["","2018-08-21","Tisdag",null,0,0,{"$f":"IFERROR(VLOOKUP(B248,Helgdagar!A$2:C$24,3,FALSE),\"\")&\nIFERROR(VLOOKUP(B248,Helgdagar!E$2:G$24,3,FALSE),\"\")&\nIFERROR(VLOOKUP(B248,Helgdagar!I$2:K$24,3,FALSE),\"\")","v":""}]
["","2018-08-22","Onsdag",null,0,0,{"$f":"IFERROR(VLOOKUP(B249,Helgdagar!A$2:C$24,3,FALSE),\"\")&\nIFERROR(VLOOKUP(B249,Helgdagar!E$2:G$24,3,FALSE),\"\")&\nIFERROR(VLOOKUP(B249,Helgdagar!I$2:K$24,3,FALSE),\"\")","v":""}]
["","2018-08-23","Torsdag",null,0,0,{"$f":"IFERROR(VLOOKUP(B250,Helgdagar!A$2:C$24,3,FALSE),\"\")&\nIFERROR(VLOOKUP(B250,Helgdagar!E$2:G$24,3,FALSE),\"\")&\nIFERROR(VLOOKUP(B250,Helgdagar!I$2:K$24,3,FALSE),\"\")","v":""}]
["","2018-08-24","Fredag",null,0,0,{"$f":"IFERROR(VLOOKUP(B251,Helgdagar!A$2:C$24,3,FALSE),\"\")&\nIFERROR(VLOOKUP(B251,Helgdagar!E$2:G$24,3,FALSE),\"\")&\nIFERROR(VLOOKUP(B251,Helgdagar!I$2:K$24,3,FALSE),\"\")","v":""}]
["","2018-08-25","Lördag",null,0,0,{"$f":"IFERROR(VLOOKUP(B252,Helgdagar!A$2:C$24,3,FALSE),\"\")&\nIFERROR(VLOOKUP(B252,Helgdagar!E$2:G$24,3,FALSE),\"\")&\nIFERROR(VLOOKUP(B252,Helgdagar!I$2:K$24,3,FALSE),\"\")","v":""}]
["","2018-08-26","Söndag",null,0,0,{"$f":"IFERROR(VLOOKUP(B253,Helgdagar!A$2:C$24,3,FALSE),\"\")&\nIFERROR(VLOOKUP(B253,Helgdagar!E$2:G$24,3,FALSE),\"\")&\nIFERROR(VLOOKUP(B253,Helgdagar!I$2:K$24,3,FALSE),\"\")","v":""}]
["V. 35","2018-08-27","Måndag",null,0,0,{"$f":"IFERROR(VLOOKUP(B254,Helgdagar!A$2:C$24,3,FALSE),\"\")&\nIFERROR(VLOOKUP(B254,Helgdagar!E$2:G$24,3,FALSE),\"\")&\nIFERROR(VLOOKUP(B254,Helgdagar!I$2:K$24,3,FALSE),\"\")","v":""}]
["","2018-08-28","Tisdag",null,0,0,{"$f":"IFERROR(VLOOKUP(B255,Helgdagar!A$2:C$24,3,FALSE),\"\")&\nIFERROR(VLOOKUP(B255,Helgdagar!E$2:G$24,3,FALSE),\"\")&\nIFERROR(VLOOKUP(B255,Helgdagar!I$2:K$24,3,FALSE),\"\")","v":""}]
["","2018-08-29","Onsdag",null,0,0,{"$f":"IFERROR(VLOOKUP(B256,Helgdagar!A$2:C$24,3,FALSE),\"\")&\nIFERROR(VLOOKUP(B256,Helgdagar!E$2:G$24,3,FALSE),\"\")&\nIFERROR(VLOOKUP(B256,Helgdagar!I$2:K$24,3,FALSE),\"\")","v":""}]
["","2018-08-30","Torsdag",null,0,0,{"$f":"IFERROR(VLOOKUP(B257,Helgdagar!A$2:C$24,3,FALSE),\"\")&\nIFERROR(VLOOKUP(B257,Helgdagar!E$2:G$24,3,FALSE),\"\")&\nIFERROR(VLOOKUP(B257,Helgdagar!I$2:K$24,3,FALSE),\"\")","v":""}]
["","2018-08-31","Fredag",null,0,0,{"$f":"IFERROR(VLOOKUP(B258,Helgdagar!A$2:C$24,3,FALSE),\"\")&\nIFERROR(VLOOKUP(B258,Helgdagar!E$2:G$24,3,FALSE),\"\")&\nIFERROR(VLOOKUP(B258,Helgdagar!I$2:K$24,3,FALSE),\"\")","v":""}]
["V. 35","2018-09-01","Lördag",null,0,0,{"$f":"IFERROR(VLOOKUP(B259,Helgdagar!A$2:C$24,3,FALSE),\"\")&\nIFERROR(VLOOKUP(B259,Helgdagar!E$2:G$24,3,FALSE),\"\")&\nIFERROR(VLOOKUP(B259,Helgdagar!I$2:K$24,3,FALSE),\"\")","v":""}]
["","2018-09-02","Söndag",null,0,0,{"$f":"IFERROR(VLOOKUP(B260,Helgdagar!A$2:C$24,3,FALSE),\"\")&\nIFERROR(VLOOKUP(B260,Helgdagar!E$2:G$24,3,FALSE),\"\")&\nIFERROR(VLOOKUP(B260,Helgdagar!I$2:K$24,3,FALSE),\"\")","v":""}]
["V. 36","2018-09-03","Måndag",null,0,0,{"$f":"IFERROR(VLOOKUP(B261,Helgdagar!A$2:C$24,3,FALSE),\"\")&\nIFERROR(VLOOKUP(B261,Helgdagar!E$2:G$24,3,FALSE),\"\")&\nIFERROR(VLOOKUP(B261,Helgdagar!I$2:K$24,3,FALSE),\"\")","v":""}]
["","2018-09-04","Tisdag",null,0,0,{"$f":"IFERROR(VLOOKUP(B262,Helgdagar!A$2:C$24,3,FALSE),\"\")&\nIFERROR(VLOOKUP(B262,Helgdagar!E$2:G$24,3,FALSE),\"\")&\nIFERROR(VLOOKUP(B262,Helgdagar!I$2:K$24,3,FALSE),\"\")","v":""}]
["","2018-09-05","Onsdag",null,0,0,{"$f":"IFERROR(VLOOKUP(B263,Helgdagar!A$2:C$24,3,FALSE),\"\")&\nIFERROR(VLOOKUP(B263,Helgdagar!E$2:G$24,3,FALSE),\"\")&\nIFERROR(VLOOKUP(B263,Helgdagar!I$2:K$24,3,FALSE),\"\")","v":""}]
["","2018-09-06","Torsdag",null,0,0,{"$f":"IFERROR(VLOOKUP(B264,Helgdagar!A$2:C$24,3,FALSE),\"\")&\nIFERROR(VLOOKUP(B264,Helgdagar!E$2:G$24,3,FALSE),\"\")&\nIFERROR(VLOOKUP(B264,Helgdagar!I$2:K$24,3,FALSE),\"\")","v":""}]
["","2018-09-07","Fredag",null,0,0,{"$f":"IFERROR(VLOOKUP(B265,Helgdagar!A$2:C$24,3,FALSE),\"\")&\nIFERROR(VLOOKUP(B265,Helgdagar!E$2:G$24,3,FALSE),\"\")&\nIFERROR(VLOOKUP(B265,Helgdagar!I$2:K$24,3,FALSE),\"\")","v":""}]
["","2018-09-08","Lördag",null,0,0,{"$f":"IFERROR(VLOOKUP(B266,Helgdagar!A$2:C$24,3,FALSE),\"\")&\nIFERROR(VLOOKUP(B266,Helgdagar!E$2:G$24,3,FALSE),\"\")&\nIFERROR(VLOOKUP(B266,Helgdagar!I$2:K$24,3,FALSE),\"\")","v":""}]
["","2018-09-09","Söndag",null,0,0,{"$f":"IFERROR(VLOOKUP(B267,Helgdagar!A$2:C$24,3,FALSE),\"\")&\nIFERROR(VLOOKUP(B267,Helgdagar!E$2:G$24,3,FALSE),\"\")&\nIFERROR(VLOOKUP(B267,Helgdagar!I$2:K$24,3,FALSE),\"\")","v":""}]
["V. 37","2018-09-10","Måndag",null,0,0,{"$f":"IFERROR(VLOOKUP(B268,Helgdagar!A$2:C$24,3,FALSE),\"\")&\nIFERROR(VLOOKUP(B268,Helgdagar!E$2:G$24,3,FALSE),\"\")&\nIFERROR(VLOOKUP(B268,Helgdagar!I$2:K$24,3,FALSE),\"\")","v":""}]
["","2018-09-11","Tisdag",null,0,0,{"$f":"IFERROR(VLOOKUP(B269,Helgdagar!A$2:C$24,3,FALSE),\"\")&\nIFERROR(VLOOKUP(B269,Helgdagar!E$2:G$24,3,FALSE),\"\")&\nIFERROR(VLOOKUP(B269,Helgdagar!I$2:K$24,3,FALSE),\"\")","v":""}]
["","2018-09-12","Onsdag",null,0,0,{"$f":"IFERROR(VLOOKUP(B270,Helgdagar!A$2:C$24,3,FALSE),\"\")&\nIFERROR(VLOOKUP(B270,Helgdagar!E$2:G$24,3,FALSE),\"\")&\nIFERROR(VLOOKUP(B270,Helgdagar!I$2:K$24,3,FALSE),\"\")","v":""}]
["","2018-09-13","Torsdag",null,0,0,{"$f":"IFERROR(VLOOKUP(B271,Helgdagar!A$2:C$24,3,FALSE),\"\")&\nIFERROR(VLOOKUP(B271,Helgdagar!E$2:G$24,3,FALSE),\"\")&\nIFERROR(VLOOKUP(B271,Helgdagar!I$2:K$24,3,FALSE),\"\")","v":""}]
["","2018-09-14","Fredag",null,{"$f":"IF(ISNUMBER(D272),IF($C$2,TEXT(TEXT(D272,\"00\\:00\"),\"[t]:mm\"),\n(TEXT(D272,\"00\\:00\"))*24),0)","v":0},{"$f":"IF(OR(ISNUMBER(D272),D272=\"F\",D272=\"EN\",D272=\"0-dag\",D272=\"FV\",D272=\"NK\"),TEXT(\nIF(OR(D272=\"F\",D272=\"EN\",D272=\"0-dag\",D272=\"NK\"),0,\nIF(D272=\"FV\",TEXT(Idealtid,\"00\\:00\"),\nIF(D272>Idealtid,(TEXT(D272,\"00\\:00\")-TEXT(Idealtid,\"00\\:00\")),(TEXT(Idealtid,\"00\\:00\")-TEXT(D272,\"00\\:00\")))))\n*IF($C$2,1,24),\nIF($C$2,\"[t]:mm\",\"0,0#\")),0)","v":0},{"$f":"IFERROR(VLOOKUP(B272,Helgdagar!A$2:C$24,3,FALSE),\"\")&\nIFERROR(VLOOKUP(B272,Helgdagar!E$2:G$24,3,FALSE),\"\")&\nIFERROR(VLOOKUP(B272,Helgdagar!I$2:K$24,3,FALSE),\"\")","v":""}]
[{"$f":"IF(OR(WEEKDAY(B273)=2,B273=DATE(YEAR(B273),MONTH(B273),1)),\"V. \"&WEEKNUM(B273,21),\"\")","v":""},"2018-09-15","Lördag",null,0,0,{"$f":"IFERROR(VLOOKUP(B273,Helgdagar!A$2:C$24,3,FALSE),\"\")&\nIFERROR(VLOOKUP(B273,Helgdagar!E$2:G$24,3,FALSE),\"\")&\nIFERROR(VLOOKUP(B273,Helgdagar!I$2:K$24,3,FALSE),\"\")","v":""}]
["",{"$f":"B273+1","v":"2018-09-16"},{"$f":"PROPER(TEXT(B274,\"dddd\"))","v":"Söndag"},null,0,0,{"$f":"IFERROR(VLOOKUP(B274,Helgdagar!A$2:C$24,3,FALSE),\"\")&\nIFERROR(VLOOKUP(B274,Helgdagar!E$2:G$24,3,FALSE),\"\")&\nIFERROR(VLOOKUP(B274,Helgdagar!I$2:K$24,3,FALSE),\"\")","v":""}]
["V. 38","2018-09-17","Måndag",null,0,0,{"$f":"IFERROR(VLOOKUP(B275,Helgdagar!A$2:C$24,3,FALSE),\"\")&\nIFERROR(VLOOKUP(B275,Helgdagar!E$2:G$24,3,FALSE),\"\")&\nIFERROR(VLOOKUP(B275,Helgdagar!I$2:K$24,3,FALSE),\"\")","v":""}]
["","2018-09-18","Tisdag",null,0,0,{"$f":"IFERROR(VLOOKUP(B276,Helgdagar!A$2:C$24,3,FALSE),\"\")&\nIFERROR(VLOOKUP(B276,Helgdagar!E$2:G$24,3,FALSE),\"\")&\nIFERROR(VLOOKUP(B276,Helgdagar!I$2:K$24,3,FALSE),\"\")","v":""}]
["","2018-09-19","Onsdag",null,0,0,{"$f":"IFERROR(VLOOKUP(B277,Helgdagar!A$2:C$24,3,FALSE),\"\")&\nIFERROR(VLOOKUP(B277,Helgdagar!E$2:G$24,3,FALSE),\"\")&\nIFERROR(VLOOKUP(B277,Helgdagar!I$2:K$24,3,FALSE),\"\")","v":""}]
["","2018-09-20","Torsdag",null,0,0,{"$f":"IFERROR(VLOOKUP(B278,Helgdagar!A$2:C$24,3,FALSE),\"\")&\nIFERROR(VLOOKUP(B278,Helgdagar!E$2:G$24,3,FALSE),\"\")&\nIFERROR(VLOOKUP(B278,Helgdagar!I$2:K$24,3,FALSE),\"\")","v":""}]
["","2018-09-21","Fredag",null,0,0,{"$f":"IFERROR(VLOOKUP(B279,Helgdagar!A$2:C$24,3,FALSE),\"\")&\nIFERROR(VLOOKUP(B279,Helgdagar!E$2:G$24,3,FALSE),\"\")&\nIFERROR(VLOOKUP(B279,Helgdagar!I$2:K$24,3,FALSE),\"\")","v":""}]
["","2018-09-22","Lördag",null,0,0,{"$f":"IFERROR(VLOOKUP(B280,Helgdagar!A$2:C$24,3,FALSE),\"\")&\nIFERROR(VLOOKUP(B280,Helgdagar!E$2:G$24,3,FALSE),\"\")&\nIFERROR(VLOOKUP(B280,Helgdagar!I$2:K$24,3,FALSE),\"\")","v":""}]
["","2018-09-23","Söndag",null,0,0,{"$f":"IFERROR(VLOOKUP(B281,Helgdagar!A$2:C$24,3,FALSE),\"\")&\nIFERROR(VLOOKUP(B281,Helgdagar!E$2:G$24,3,FALSE),\"\")&\nIFERROR(VLOOKUP(B281,Helgdagar!I$2:K$24,3,FALSE),\"\")","v":""}]
["V. 39","2018-09-24","Måndag",null,0,0,{"$f":"IFERROR(VLOOKUP(B282,Helgdagar!A$2:C$24,3,FALSE),\"\")&\nIFERROR(VLOOKUP(B282,Helgdagar!E$2:G$24,3,FALSE),\"\")&\nIFERROR(VLOOKUP(B282,Helgdagar!I$2:K$24,3,FALSE),\"\")","v":""}]
["","2018-09-25","Tisdag",null,0,0,{"$f":"IFERROR(VLOOKUP(B283,Helgdagar!A$2:C$24,3,FALSE),\"\")&\nIFERROR(VLOOKUP(B283,Helgdagar!E$2:G$24,3,FALSE),\"\")&\nIFERROR(VLOOKUP(B283,Helgdagar!I$2:K$24,3,FALSE),\"\")","v":""}]
["","2018-09-26","Onsdag",null,0,0,{"$f":"IFERROR(VLOOKUP(B284,Helgdagar!A$2:C$24,3,FALSE),\"\")&\nIFERROR(VLOOKUP(B284,Helgdagar!E$2:G$24,3,FALSE),\"\")&\nIFERROR(VLOOKUP(B284,Helgdagar!I$2:K$24,3,FALSE),\"\")","v":""}]
["","2018-09-27","Torsdag",null,0,0,{"$f":"IFERROR(VLOOKUP(B285,Helgdagar!A$2:C$24,3,FALSE),\"\")&\nIFERROR(VLOOKUP(B285,Helgdagar!E$2:G$24,3,FALSE),\"\")&\nIFERROR(VLOOKUP(B285,Helgdagar!I$2:K$24,3,FALSE),\"\")","v":""}]
["","2018-09-28","Fredag",null,0,0,{"$f":"IFERROR(VLOOKUP(B286,Helgdagar!A$2:C$24,3,FALSE),\"\")&\nIFERROR(VLOOKUP(B286,Helgdagar!E$2:G$24,3,FALSE),\"\")&\nIFERROR(VLOOKUP(B286,Helgdagar!I$2:K$24,3,FALSE),\"\")","v":""}]
["","2018-09-29","Lördag",null,0,0,{"$f":"IFERROR(VLOOKUP(B287,Helgdagar!A$2:C$24,3,FALSE),\"\")&\nIFERROR(VLOOKUP(B287,Helgdagar!E$2:G$24,3,FALSE),\"\")&\nIFERROR(VLOOKUP(B287,Helgdagar!I$2:K$24,3,FALSE),\"\")","v":""}]
["","2018-09-30","Söndag",null,0,0,{"$f":"IFERROR(VLOOKUP(B288,Helgdagar!A$2:C$24,3,FALSE),\"\")&\nIFERROR(VLOOKUP(B288,Helgdagar!E$2:G$24,3,FALSE),\"\")&\nIFERROR(VLOOKUP(B288,Helgdagar!I$2:K$24,3,FALSE),\"\")","v":""}]
["V. 40","2018-10-01","Måndag",null,0,0,{"$f":"IFERROR(VLOOKUP(B289,Helgdagar!A$2:C$24,3,FALSE),\"\")&\nIFERROR(VLOOKUP(B289,Helgdagar!E$2:G$24,3,FALSE),\"\")&\nIFERROR(VLOOKUP(B289,Helgdagar!I$2:K$24,3,FALSE),\"\")","v":""}]
["","2018-10-02","Tisdag",null,0,0,{"$f":"IFERROR(VLOOKUP(B290,Helgdagar!A$2:C$24,3,FALSE),\"\")&\nIFERROR(VLOOKUP(B290,Helgdagar!E$2:G$24,3,FALSE),\"\")&\nIFERROR(VLOOKUP(B290,Helgdagar!I$2:K$24,3,FALSE),\"\")","v":""}]
["","2018-10-03","Onsdag",null,0,0,{"$f":"IFERROR(VLOOKUP(B291,Helgdagar!A$2:C$24,3,FALSE),\"\")&\nIFERROR(VLOOKUP(B291,Helgdagar!E$2:G$24,3,FALSE),\"\")&\nIFERROR(VLOOKUP(B291,Helgdagar!I$2:K$24,3,FALSE),\"\")","v":""}]
["","2018-10-04","Torsdag",null,0,0,{"$f":"IFERROR(VLOOKUP(B292,Helgdagar!A$2:C$24,3,FALSE),\"\")&\nIFERROR(VLOOKUP(B292,Helgdagar!E$2:G$24,3,FALSE),\"\")&\nIFERROR(VLOOKUP(B292,Helgdagar!I$2:K$24,3,FALSE),\"\")","v":""}]
["","2018-10-05","Fredag",null,0,0,{"$f":"IFERROR(VLOOKUP(B293,Helgdagar!A$2:C$24,3,FALSE),\"\")&\nIFERROR(VLOOKUP(B293,Helgdagar!E$2:G$24,3,FALSE),\"\")&\nIFERROR(VLOOKUP(B293,Helgdagar!I$2:K$24,3,FALSE),\"\")","v":""}]
["","2018-10-06","Lördag",null,0,0,{"$f":"IFERROR(VLOOKUP(B294,Helgdagar!A$2:C$24,3,FALSE),\"\")&\nIFERROR(VLOOKUP(B294,Helgdagar!E$2:G$24,3,FALSE),\"\")&\nIFERROR(VLOOKUP(B294,Helgdagar!I$2:K$24,3,FALSE),\"\")","v":""}]
["","2018-10-07","Söndag",null,0,0,{"$f":"IFERROR(VLOOKUP(B295,Helgdagar!A$2:C$24,3,FALSE),\"\")&\nIFERROR(VLOOKUP(B295,Helgdagar!E$2:G$24,3,FALSE),\"\")&\nIFERROR(VLOOKUP(B295,Helgdagar!I$2:K$24,3,FALSE),\"\")","v":""}]
["V. 41","2018-10-08","Måndag",null,0,0,{"$f":"IFERROR(VLOOKUP(B296,Helgdagar!A$2:C$24,3,FALSE),\"\")&\nIFERROR(VLOOKUP(B296,Helgdagar!E$2:G$24,3,FALSE),\"\")&\nIFERROR(VLOOKUP(B296,Helgdagar!I$2:K$24,3,FALSE),\"\")","v":""}]
["","2018-10-09","Tisdag",null,0,0,{"$f":"IFERROR(VLOOKUP(B297,Helgdagar!A$2:C$24,3,FALSE),\"\")&\nIFERROR(VLOOKUP(B297,Helgdagar!E$2:G$24,3,FALSE),\"\")&\nIFERROR(VLOOKUP(B297,Helgdagar!I$2:K$24,3,FALSE),\"\")","v":""}]
["","2018-10-10","Onsdag",null,0,0,{"$f":"IFERROR(VLOOKUP(B298,Helgdagar!A$2:C$24,3,FALSE),\"\")&\nIFERROR(VLOOKUP(B298,Helgdagar!E$2:G$24,3,FALSE),\"\")&\nIFERROR(VLOOKUP(B298,Helgdagar!I$2:K$24,3,FALSE),\"\")","v":""}]
["","2018-10-11","Torsdag",null,0,0,{"$f":"IFERROR(VLOOKUP(B299,Helgdagar!A$2:C$24,3,FALSE),\"\")&\nIFERROR(VLOOKUP(B299,Helgdagar!E$2:G$24,3,FALSE),\"\")&\nIFERROR(VLOOKUP(B299,Helgdagar!I$2:K$24,3,FALSE),\"\")","v":""}]
["","2018-10-12","Fredag",null,0,0,{"$f":"IFERROR(VLOOKUP(B300,Helgdagar!A$2:C$24,3,FALSE),\"\")&\nIFERROR(VLOOKUP(B300,Helgdagar!E$2:G$24,3,FALSE),\"\")&\nIFERROR(VLOOKUP(B300,Helgdagar!I$2:K$24,3,FALSE),\"\")","v":""}]
["","2018-10-13","Lördag",null,0,0,{"$f":"IFERROR(VLOOKUP(B301,Helgdagar!A$2:C$24,3,FALSE),\"\")&\nIFERROR(VLOOKUP(B301,Helgdagar!E$2:G$24,3,FALSE),\"\")&\nIFERROR(VLOOKUP(B301,Helgdagar!I$2:K$24,3,FALSE),\"\")","v":""}]
["","2018-10-14","Söndag",null,0,0,{"$f":"IFERROR(VLOOKUP(B302,Helgdagar!A$2:C$24,3,FALSE),\"\")&\nIFERROR(VLOOKUP(B302,Helgdagar!E$2:G$24,3,FALSE),\"\")&\nIFERROR(VLOOKUP(B302,Helgdagar!I$2:K$24,3,FALSE),\"\")","v":""}]
["V. 42","2018-10-15","Måndag",null,0,0,{"$f":"IFERROR(VLOOKUP(B303,Helgdagar!A$2:C$24,3,FALSE),\"\")&\nIFERROR(VLOOKUP(B303,Helgdagar!E$2:G$24,3,FALSE),\"\")&\nIFERROR(VLOOKUP(B303,Helgdagar!I$2:K$24,3,FALSE),\"\")","v":""}]
["","2018-10-16","Tisdag",null,0,0,{"$f":"IFERROR(VLOOKUP(B304,Helgdagar!A$2:C$24,3,FALSE),\"\")&\nIFERROR(VLOOKUP(B304,Helgdagar!E$2:G$24,3,FALSE),\"\")&\nIFERROR(VLOOKUP(B304,Helgdagar!I$2:K$24,3,FALSE),\"\")","v":""}]
["","2018-10-17","Onsdag",null,0,0,{"$f":"IFERROR(VLOOKUP(B305,Helgdagar!A$2:C$24,3,FALSE),\"\")&\nIFERROR(VLOOKUP(B305,Helgdagar!E$2:G$24,3,FALSE),\"\")&\nIFERROR(VLOOKUP(B305,Helgdagar!I$2:K$24,3,FALSE),\"\")","v":""}]
["","2018-10-18","Torsdag",null,0,0,{"$f":"IFERROR(VLOOKUP(B306,Helgdagar!A$2:C$24,3,FALSE),\"\")&\nIFERROR(VLOOKUP(B306,Helgdagar!E$2:G$24,3,FALSE),\"\")&\nIFERROR(VLOOKUP(B306,Helgdagar!I$2:K$24,3,FALSE),\"\")","v":""}]
["","2018-10-19","Fredag",null,0,0,{"$f":"IFERROR(VLOOKUP(B307,Helgdagar!A$2:C$24,3,FALSE),\"\")&\nIFERROR(VLOOKUP(B307,Helgdagar!E$2:G$24,3,FALSE),\"\")&\nIFERROR(VLOOKUP(B307,Helgdagar!I$2:K$24,3,FALSE),\"\")","v":""}]
["","2018-10-20","Lördag",null,0,0,{"$f":"IFERROR(VLOOKUP(B308,Helgdagar!A$2:C$24,3,FALSE),\"\")&\nIFERROR(VLOOKUP(B308,Helgdagar!E$2:G$24,3,FALSE),\"\")&\nIFERROR(VLOOKUP(B308,Helgdagar!I$2:K$24,3,FALSE),\"\")","v":""}]
["","2018-10-21","Söndag",null,0,0,{"$f":"IFERROR(VLOOKUP(B309,Helgdagar!A$2:C$24,3,FALSE),\"\")&\nIFERROR(VLOOKUP(B309,Helgdagar!E$2:G$24,3,FALSE),\"\")&\nIFERROR(VLOOKUP(B309,Helgdagar!I$2:K$24,3,FALSE),\"\")","v":""}]
["V. 43","2018-10-22","Måndag",null,0,0,{"$f":"IFERROR(VLOOKUP(B310,Helgdagar!A$2:C$24,3,FALSE),\"\")&\nIFERROR(VLOOKUP(B310,Helgdagar!E$2:G$24,3,FALSE),\"\")&\nIFERROR(VLOOKUP(B310,Helgdagar!I$2:K$24,3,FALSE),\"\")","v":""}]
["","2018-10-23","Tisdag",null,0,0,{"$f":"IFERROR(VLOOKUP(B311,Helgdagar!A$2:C$24,3,FALSE),\"\")&\nIFERROR(VLOOKUP(B311,Helgdagar!E$2:G$24,3,FALSE),\"\")&\nIFERROR(VLOOKUP(B311,Helgdagar!I$2:K$24,3,FALSE),\"\")","v":""}]
["","2018-10-24","Onsdag",null,0,0,{"$f":"IFERROR(VLOOKUP(B312,Helgdagar!A$2:C$24,3,FALSE),\"\")&\nIFERROR(VLOOKUP(B312,Helgdagar!E$2:G$24,3,FALSE),\"\")&\nIFERROR(VLOOKUP(B312,Helgdagar!I$2:K$24,3,FALSE),\"\")","v":""}]
["","2018-10-25","Torsdag",null,0,0,{"$f":"IFERROR(VLOOKUP(B313,Helgdagar!A$2:C$24,3,FALSE),\"\")&\nIFERROR(VLOOKUP(B313,Helgdagar!E$2:G$24,3,FALSE),\"\")&\nIFERROR(VLOOKUP(B313,Helgdagar!I$2:K$24,3,FALSE),\"\")","v":""}]
["","2018-10-26","Fredag",null,0,0,{"$f":"IFERROR(VLOOKUP(B314,Helgdagar!A$2:C$24,3,FALSE),\"\")&\nIFERROR(VLOOKUP(B314,Helgdagar!E$2:G$24,3,FALSE),\"\")&\nIFERROR(VLOOKUP(B314,Helgdagar!I$2:K$24,3,FALSE),\"\")","v":""}]
["","2018-10-27","Lördag",null,0,0,{"$f":"IFERROR(VLOOKUP(B315,Helgdagar!A$2:C$24,3,FALSE),\"\")&\nIFERROR(VLOOKUP(B315,Helgdagar!E$2:G$24,3,FALSE),\"\")&\nIFERROR(VLOOKUP(B315,Helgdagar!I$2:K$24,3,FALSE),\"\")","v":""}]
["","2018-10-28","Söndag",null,0,0,{"$f":"IFERROR(VLOOKUP(B316,Helgdagar!A$2:C$24,3,FALSE),\"\")&\nIFERROR(VLOOKUP(B316,Helgdagar!E$2:G$24,3,FALSE),\"\")&\nIFERROR(VLOOKUP(B316,Helgdagar!I$2:K$24,3,FALSE),\"\")","v":""}]
["V. 44","2018-10-29","Måndag",null,0,0,{"$f":"IFERROR(VLOOKUP(B317,Helgdagar!A$2:C$24,3,FALSE),\"\")&\nIFERROR(VLOOKUP(B317,Helgdagar!E$2:G$24,3,FALSE),\"\")&\nIFERROR(VLOOKUP(B317,Helgdagar!I$2:K$24,3,FALSE),\"\")","v":""}]
["","2018-10-30","Tisdag",null,0,0,{"$f":"IFERROR(VLOOKUP(B318,Helgdagar!A$2:C$24,3,FALSE),\"\")&\nIFERROR(VLOOKUP(B318,Helgdagar!E$2:G$24,3,FALSE),\"\")&\nIFERROR(VLOOKUP(B318,Helgdagar!I$2:K$24,3,FALSE),\"\")","v":""}]
["","2018-10-31","Onsdag",null,0,0,{"$f":"IFERROR(VLOOKUP(B319,Helgdagar!A$2:C$24,3,FALSE),\"\")&\nIFERROR(VLOOKUP(B319,Helgdagar!E$2:G$24,3,FALSE),\"\")&\nIFERROR(VLOOKUP(B319,Helgdagar!I$2:K$24,3,FALSE),\"\")","v":""}]
["V. 44","2018-11-01","Torsdag",null,0,0,{"$f":"IFERROR(VLOOKUP(B320,Helgdagar!A$2:C$24,3,FALSE),\"\")&\nIFERROR(VLOOKUP(B320,Helgdagar!E$2:G$24,3,FALSE),\"\")&\nIFERROR(VLOOKUP(B320,Helgdagar!I$2:K$24,3,FALSE),\"\")","v":""}]
["","2018-11-02","Fredag",null,0,0,{"$f":"IFERROR(VLOOKUP(B321,Helgdagar!A$2:C$24,3,FALSE),\"\")&\nIFERROR(VLOOKUP(B321,Helgdagar!E$2:G$24,3,FALSE),\"\")&\nIFERROR(VLOOKUP(B321,Helgdagar!I$2:K$24,3,FALSE),\"\")","v":""}]
["","2018-11-03","Lördag",null,0,0,{"$f":"IFERROR(VLOOKUP(B322,Helgdagar!A$2:C$24,3,FALSE),\"\")&\nIFERROR(VLOOKUP(B322,Helgdagar!E$2:G$24,3,FALSE),\"\")&\nIFERROR(VLOOKUP(B322,Helgdagar!I$2:K$24,3,FALSE),\"\")","v":"Alla helgons dag"}]
["","2018-11-04","Söndag",null,0,0,{"$f":"IFERROR(VLOOKUP(B323,Helgdagar!A$2:C$24,3,FALSE),\"\")&\nIFERROR(VLOOKUP(B323,Helgdagar!E$2:G$24,3,FALSE),\"\")&\nIFERROR(VLOOKUP(B323,Helgdagar!I$2:K$24,3,FALSE),\"\")","v":""}]
["V. 45","2018-11-05","Måndag",null,0,0,{"$f":"IFERROR(VLOOKUP(B324,Helgdagar!A$2:C$24,3,FALSE),\"\")&\nIFERROR(VLOOKUP(B324,Helgdagar!E$2:G$24,3,FALSE),\"\")&\nIFERROR(VLOOKUP(B324,Helgdagar!I$2:K$24,3,FALSE),\"\")","v":""}]
["","2018-11-06","Tisdag",null,0,0,{"$f":"IFERROR(VLOOKUP(B325,Helgdagar!A$2:C$24,3,FALSE),\"\")&\nIFERROR(VLOOKUP(B325,Helgdagar!E$2:G$24,3,FALSE),\"\")&\nIFERROR(VLOOKUP(B325,Helgdagar!I$2:K$24,3,FALSE),\"\")","v":""}]
["","2018-11-07","Onsdag",null,0,0,{"$f":"IFERROR(VLOOKUP(B326,Helgdagar!A$2:C$24,3,FALSE),\"\")&\nIFERROR(VLOOKUP(B326,Helgdagar!E$2:G$24,3,FALSE),\"\")&\nIFERROR(VLOOKUP(B326,Helgdagar!I$2:K$24,3,FALSE),\"\")","v":""}]
["","2018-11-08","Torsdag",null,0,0,{"$f":"IFERROR(VLOOKUP(B327,Helgdagar!A$2:C$24,3,FALSE),\"\")&\nIFERROR(VLOOKUP(B327,Helgdagar!E$2:G$24,3,FALSE),\"\")&\nIFERROR(VLOOKUP(B327,Helgdagar!I$2:K$24,3,FALSE),\"\")","v":""}]
["","2018-11-09","Fredag",null,0,0,{"$f":"IFERROR(VLOOKUP(B328,Helgdagar!A$2:C$24,3,FALSE),\"\")&\nIFERROR(VLOOKUP(B328,Helgdagar!E$2:G$24,3,FALSE),\"\")&\nIFERROR(VLOOKUP(B328,Helgdagar!I$2:K$24,3,FALSE),\"\")","v":""}]
["","2018-11-10","Lördag",null,0,0,{"$f":"IFERROR(VLOOKUP(B329,Helgdagar!A$2:C$24,3,FALSE),\"\")&\nIFERROR(VLOOKUP(B329,Helgdagar!E$2:G$24,3,FALSE),\"\")&\nIFERROR(VLOOKUP(B329,Helgdagar!I$2:K$24,3,FALSE),\"\")","v":""}]
["","2018-11-11","Söndag",null,0,0,{"$f":"IFERROR(VLOOKUP(B330,Helgdagar!A$2:C$24,3,FALSE),\"\")&\nIFERROR(VLOOKUP(B330,Helgdagar!E$2:G$24,3,FALSE),\"\")&\nIFERROR(VLOOKUP(B330,Helgdagar!I$2:K$24,3,FALSE),\"\")","v":""}]
["V. 46","2018-11-12","Måndag",null,0,0,{"$f":"IFERROR(VLOOKUP(B331,Helgdagar!A$2:C$24,3,FALSE),\"\")&\nIFERROR(VLOOKUP(B331,Helgdagar!E$2:G$24,3,FALSE),\"\")&\nIFERROR(VLOOKUP(B331,Helgdagar!I$2:K$24,3,FALSE),\"\")","v":""}]
["","2018-11-13","Tisdag",null,0,0,{"$f":"IFERROR(VLOOKUP(B332,Helgdagar!A$2:C$24,3,FALSE),\"\")&\nIFERROR(VLOOKUP(B332,Helgdagar!E$2:G$24,3,FALSE),\"\")&\nIFERROR(VLOOKUP(B332,Helgdagar!I$2:K$24,3,FALSE),\"\")","v":""}]
["","2018-11-14","Onsdag",null,0,0,{"$f":"IFERROR(VLOOKUP(B333,Helgdagar!A$2:C$24,3,FALSE),\"\")&\nIFERROR(VLOOKUP(B333,Helgdagar!E$2:G$24,3,FALSE),\"\")&\nIFERROR(VLOOKUP(B333,Helgdagar!I$2:K$24,3,FALSE),\"\")","v":""}]
["","2018-11-15","Torsdag",null,0,0,{"$f":"IFERROR(VLOOKUP(B334,Helgdagar!A$2:C$24,3,FALSE),\"\")&\nIFERROR(VLOOKUP(B334,Helgdagar!E$2:G$24,3,FALSE),\"\")&\nIFERROR(VLOOKUP(B334,Helgdagar!I$2:K$24,3,FALSE),\"\")","v":""}]
["","2018-11-16","Fredag",null,0,0,{"$f":"IFERROR(VLOOKUP(B335,Helgdagar!A$2:C$24,3,FALSE),\"\")&\nIFERROR(VLOOKUP(B335,Helgdagar!E$2:G$24,3,FALSE),\"\")&\nIFERROR(VLOOKUP(B335,Helgdagar!I$2:K$24,3,FALSE),\"\")","v":""}]
["","2018-11-17","Lördag",null,{"$f":"IF(ISNUMBER(D336),IF($C$2,TEXT(TEXT(D336,\"00\\:00\"),\"[t]:mm\"),\n(TEXT(D336,\"00\\:00\"))*24),0)","v":0},{"$f":"IF(OR(ISNUMBER(D336),D336=\"F\",D336=\"EN\",D336=\"0-dag\",D336=\"FV\",D336=\"NK\"),TEXT(\nIF(OR(D336=\"F\",D336=\"EN\",D336=\"0-dag\",D336=\"NK\"),0,\nIF(D336=\"FV\",TEXT(Idealtid,\"00\\:00\"),\nIF(D336>Idealtid,(TEXT(D336,\"00\\:00\")-TEXT(Idealtid,\"00\\:00\")),(TEXT(Idealtid,\"00\\:00\")-TEXT(D336,\"00\\:00\")))))\n*IF($C$2,1,24),\nIF($C$2,\"[t]:mm\",\"0,0#\")),0)","v":0},{"$f":"IFERROR(VLOOKUP(B336,Helgdagar!A$2:C$24,3,FALSE),\"\")&\nIFERROR(VLOOKUP(B336,Helgdagar!E$2:G$24,3,FALSE),\"\")&\nIFERROR(VLOOKUP(B336,Helgdagar!I$2:K$24,3,FALSE),\"\")","v":""}]
[{"$f":"IF(OR(WEEKDAY(B337)=2,B337=DATE(YEAR(B337),MONTH(B337),1)),\"V. \"&WEEKNUM(B337,21),\"\")","v":""},"2018-11-18","Söndag",null,0,0,{"$f":"IFERROR(VLOOKUP(B337,Helgdagar!A$2:C$24,3,FALSE),\"\")&\nIFERROR(VLOOKUP(B337,Helgdagar!E$2:G$24,3,FALSE),\"\")&\nIFERROR(VLOOKUP(B337,Helgdagar!I$2:K$24,3,FALSE),\"\")","v":""}]
["V. 47",{"$f":"B337+1","v":"2018-11-19"},{"$f":"PROPER(TEXT(B338,\"dddd\"))","v":"Måndag"},null,0,0,{"$f":"IFERROR(VLOOKUP(B338,Helgdagar!A$2:C$24,3,FALSE),\"\")&\nIFERROR(VLOOKUP(B338,Helgdagar!E$2:G$24,3,FALSE),\"\")&\nIFERROR(VLOOKUP(B338,Helgdagar!I$2:K$24,3,FALSE),\"\")","v":""}]
["","2018-11-20","Tisdag",null,0,0,{"$f":"IFERROR(VLOOKUP(B339,Helgdagar!A$2:C$24,3,FALSE),\"\")&\nIFERROR(VLOOKUP(B339,Helgdagar!E$2:G$24,3,FALSE),\"\")&\nIFERROR(VLOOKUP(B339,Helgdagar!I$2:K$24,3,FALSE),\"\")","v":""}]
["","2018-11-21","Onsdag",null,0,0,{"$f":"IFERROR(VLOOKUP(B340,Helgdagar!A$2:C$24,3,FALSE),\"\")&\nIFERROR(VLOOKUP(B340,Helgdagar!E$2:G$24,3,FALSE),\"\")&\nIFERROR(VLOOKUP(B340,Helgdagar!I$2:K$24,3,FALSE),\"\")","v":""}]
["","2018-11-22","Torsdag",null,0,0,{"$f":"IFERROR(VLOOKUP(B341,Helgdagar!A$2:C$24,3,FALSE),\"\")&\nIFERROR(VLOOKUP(B341,Helgdagar!E$2:G$24,3,FALSE),\"\")&\nIFERROR(VLOOKUP(B341,Helgdagar!I$2:K$24,3,FALSE),\"\")","v":""}]
["","2018-11-23","Fredag",null,0,0,{"$f":"IFERROR(VLOOKUP(B342,Helgdagar!A$2:C$24,3,FALSE),\"\")&\nIFERROR(VLOOKUP(B342,Helgdagar!E$2:G$24,3,FALSE),\"\")&\nIFERROR(VLOOKUP(B342,Helgdagar!I$2:K$24,3,FALSE),\"\")","v":""}]
["","2018-11-24","Lördag",null,0,0,{"$f":"IFERROR(VLOOKUP(B343,Helgdagar!A$2:C$24,3,FALSE),\"\")&\nIFERROR(VLOOKUP(B343,Helgdagar!E$2:G$24,3,FALSE),\"\")&\nIFERROR(VLOOKUP(B343,Helgdagar!I$2:K$24,3,FALSE),\"\")","v":""}]
["","2018-11-25","Söndag",null,0,0,{"$f":"IFERROR(VLOOKUP(B344,Helgdagar!A$2:C$24,3,FALSE),\"\")&\nIFERROR(VLOOKUP(B344,Helgdagar!E$2:G$24,3,FALSE),\"\")&\nIFERROR(VLOOKUP(B344,Helgdagar!I$2:K$24,3,FALSE),\"\")","v":""}]
["V. 48","2018-11-26","Måndag",null,0,0,{"$f":"IFERROR(VLOOKUP(B345,Helgdagar!A$2:C$24,3,FALSE),\"\")&\nIFERROR(VLOOKUP(B345,Helgdagar!E$2:G$24,3,FALSE),\"\")&\nIFERROR(VLOOKUP(B345,Helgdagar!I$2:K$24,3,FALSE),\"\")","v":""}]
["","2018-11-27","Tisdag",null,0,0,{"$f":"IFERROR(VLOOKUP(B346,Helgdagar!A$2:C$24,3,FALSE),\"\")&\nIFERROR(VLOOKUP(B346,Helgdagar!E$2:G$24,3,FALSE),\"\")&\nIFERROR(VLOOKUP(B346,Helgdagar!I$2:K$24,3,FALSE),\"\")","v":""}]
["","2018-11-28","Onsdag",null,0,0,{"$f":"IFERROR(VLOOKUP(B347,Helgdagar!A$2:C$24,3,FALSE),\"\")&\nIFERROR(VLOOKUP(B347,Helgdagar!E$2:G$24,3,FALSE),\"\")&\nIFERROR(VLOOKUP(B347,Helgdagar!I$2:K$24,3,FALSE),\"\")","v":""}]
["","2018-11-29","Torsdag",null,0,0,{"$f":"IFERROR(VLOOKUP(B348,Helgdagar!A$2:C$24,3,FALSE),\"\")&\nIFERROR(VLOOKUP(B348,Helgdagar!E$2:G$24,3,FALSE),\"\")&\nIFERROR(VLOOKUP(B348,Helgdagar!I$2:K$24,3,FALSE),\"\")","v":""}]
["","2018-11-30","Fredag",null,0,0,{"$f":"IFERROR(VLOOKUP(B349,Helgdagar!A$2:C$24,3,FALSE),\"\")&\nIFERROR(VLOOKUP(B349,Helgdagar!E$2:G$24,3,FALSE),\"\")&\nIFERROR(VLOOKUP(B349,Helgdagar!I$2:K$24,3,FALSE),\"\")","v":""}]
["V. 48","2018-12-01","Lördag",null,0,0,{"$f":"IFERROR(VLOOKUP(B350,Helgdagar!A$2:C$24,3,FALSE),\"\")&\nIFERROR(VLOOKUP(B350,Helgdagar!E$2:G$24,3,FALSE),\"\")&\nIFERROR(VLOOKUP(B350,Helgdagar!I$2:K$24,3,FALSE),\"\")","v":""}]
["","2018-12-02","Söndag",null,0,0,{"$f":"IFERROR(VLOOKUP(B351,Helgdagar!A$2:C$24,3,FALSE),\"\")&\nIFERROR(VLOOKUP(B351,Helgdagar!E$2:G$24,3,FALSE),\"\")&\nIFERROR(VLOOKUP(B351,Helgdagar!I$2:K$24,3,FALSE),\"\")","v":""}]
["V. 49","2018-12-03","Måndag",null,0,0,{"$f":"IFERROR(VLOOKUP(B352,Helgdagar!A$2:C$24,3,FALSE),\"\")&\nIFERROR(VLOOKUP(B352,Helgdagar!E$2:G$24,3,FALSE),\"\")&\nIFERROR(VLOOKUP(B352,Helgdagar!I$2:K$24,3,FALSE),\"\")","v":""}]
["","2018-12-04","Tisdag",null,0,0,{"$f":"IFERROR(VLOOKUP(B353,Helgdagar!A$2:C$24,3,FALSE),\"\")&\nIFERROR(VLOOKUP(B353,Helgdagar!E$2:G$24,3,FALSE),\"\")&\nIFERROR(VLOOKUP(B353,Helgdagar!I$2:K$24,3,FALSE),\"\")","v":""}]
["","2018-12-05","Onsdag",null,0,0,{"$f":"IFERROR(VLOOKUP(B354,Helgdagar!A$2:C$24,3,FALSE),\"\")&\nIFERROR(VLOOKUP(B354,Helgdagar!E$2:G$24,3,FALSE),\"\")&\nIFERROR(VLOOKUP(B354,Helgdagar!I$2:K$24,3,FALSE),\"\")","v":""}]
["","2018-12-06","Torsdag",null,0,0,{"$f":"IFERROR(VLOOKUP(B355,Helgdagar!A$2:C$24,3,FALSE),\"\")&\nIFERROR(VLOOKUP(B355,Helgdagar!E$2:G$24,3,FALSE),\"\")&\nIFERROR(VLOOKUP(B355,Helgdagar!I$2:K$24,3,FALSE),\"\")","v":""}]
["","2018-12-07","Fredag",null,0,0,{"$f":"IFERROR(VLOOKUP(B356,Helgdagar!A$2:C$24,3,FALSE),\"\")&\nIFERROR(VLOOKUP(B356,Helgdagar!E$2:G$24,3,FALSE),\"\")&\nIFERROR(VLOOKUP(B356,Helgdagar!I$2:K$24,3,FALSE),\"\")","v":""}]
["","2018-12-08","Lördag",null,0,0,{"$f":"IFERROR(VLOOKUP(B357,Helgdagar!A$2:C$24,3,FALSE),\"\")&\nIFERROR(VLOOKUP(B357,Helgdagar!E$2:G$24,3,FALSE),\"\")&\nIFERROR(VLOOKUP(B357,Helgdagar!I$2:K$24,3,FALSE),\"\")","v":""}]
["","2018-12-09","Söndag",null,0,0,{"$f":"IFERROR(VLOOKUP(B358,Helgdagar!A$2:C$24,3,FALSE),\"\")&\nIFERROR(VLOOKUP(B358,Helgdagar!E$2:G$24,3,FALSE),\"\")&\nIFERROR(VLOOKUP(B358,Helgdagar!I$2:K$24,3,FALSE),\"\")","v":""}]
["V. 50","2018-12-10","Måndag",null,0,0,{"$f":"IFERROR(VLOOKUP(B359,Helgdagar!A$2:C$24,3,FALSE),\"\")&\nIFERROR(VLOOKUP(B359,Helgdagar!E$2:G$24,3,FALSE),\"\")&\nIFERROR(VLOOKUP(B359,Helgdagar!I$2:K$24,3,FALSE),\"\")","v":""}]
["","2018-12-11","Tisdag",null,0,0,{"$f":"IFERROR(VLOOKUP(B360,Helgdagar!A$2:C$24,3,FALSE),\"\")&\nIFERROR(VLOOKUP(B360,Helgdagar!E$2:G$24,3,FALSE),\"\")&\nIFERROR(VLOOKUP(B360,Helgdagar!I$2:K$24,3,FALSE),\"\")","v":""}]
["","2018-12-12","Onsdag",null,0,0,{"$f":"IFERROR(VLOOKUP(B361,Helgdagar!A$2:C$24,3,FALSE),\"\")&\nIFERROR(VLOOKUP(B361,Helgdagar!E$2:G$24,3,FALSE),\"\")&\nIFERROR(VLOOKUP(B361,Helgdagar!I$2:K$24,3,FALSE),\"\")","v":""}]
["","2018-12-13","Torsdag",null,0,0,{"$f":"IFERROR(VLOOKUP(B362,Helgdagar!A$2:C$24,3,FALSE),\"\")&\nIFERROR(VLOOKUP(B362,Helgdagar!E$2:G$24,3,FALSE),\"\")&\nIFERROR(VLOOKUP(B362,Helgdagar!I$2:K$24,3,FALSE),\"\")","v":""}]
["","2018-12-14","Fredag",null,0,0,{"$f":"IFERROR(VLOOKUP(B363,Helgdagar!A$2:C$24,3,FALSE),\"\")&\nIFERROR(VLOOKUP(B363,Helgdagar!E$2:G$24,3,FALSE),\"\")&\nIFERROR(VLOOKUP(B363,Helgdagar!I$2:K$24,3,FALSE),\"\")","v":""}]
["","2018-12-15","Lördag",null,0,0,{"$f":"IFERROR(VLOOKUP(B364,Helgdagar!A$2:C$24,3,FALSE),\"\")&\nIFERROR(VLOOKUP(B364,Helgdagar!E$2:G$24,3,FALSE),\"\")&\nIFERROR(VLOOKUP(B364,Helgdagar!I$2:K$24,3,FALSE),\"\")","v":""}]
["","2018-12-16","Söndag",null,0,0,{"$f":"IFERROR(VLOOKUP(B365,Helgdagar!A$2:C$24,3,FALSE),\"\")&\nIFERROR(VLOOKUP(B365,Helgdagar!E$2:G$24,3,FALSE),\"\")&\nIFERROR(VLOOKUP(B365,Helgdagar!I$2:K$24,3,FALSE),\"\")","v":""}]
["V. 51","2018-12-17","Måndag",null,0,0,{"$f":"IFERROR(VLOOKUP(B366,Helgdagar!A$2:C$24,3,FALSE),\"\")&\nIFERROR(VLOOKUP(B366,Helgdagar!E$2:G$24,3,FALSE),\"\")&\nIFERROR(VLOOKUP(B366,Helgdagar!I$2:K$24,3,FALSE),\"\")","v":""}]
["","2018-12-18","Tisdag",null,0,0,{"$f":"IFERROR(VLOOKUP(B367,Helgdagar!A$2:C$24,3,FALSE),\"\")&\nIFERROR(VLOOKUP(B367,Helgdagar!E$2:G$24,3,FALSE),\"\")&\nIFERROR(VLOOKUP(B367,Helgdagar!I$2:K$24,3,FALSE),\"\")","v":""}]
["","2018-12-19","Onsdag",null,0,0,{"$f":"IFERROR(VLOOKUP(B368,Helgdagar!A$2:C$24,3,FALSE),\"\")&\nIFERROR(VLOOKUP(B368,Helgdagar!E$2:G$24,3,FALSE),\"\")&\nIFERROR(VLOOKUP(B368,Helgdagar!I$2:K$24,3,FALSE),\"\")","v":""}]
["","2018-12-20","Torsdag",null,0,0,{"$f":"IFERROR(VLOOKUP(B369,Helgdagar!A$2:C$24,3,FALSE),\"\")&\nIFERROR(VLOOKUP(B369,Helgdagar!E$2:G$24,3,FALSE),\"\")&\nIFERROR(VLOOKUP(B369,Helgdagar!I$2:K$24,3,FALSE),\"\")","v":""}]
["","2018-12-21","Fredag",null,0,0,{"$f":"IFERROR(VLOOKUP(B370,Helgdagar!A$2:C$24,3,FALSE),\"\")&\nIFERROR(VLOOKUP(B370,Helgdagar!E$2:G$24,3,FALSE),\"\")&\nIFERROR(VLOOKUP(B370,Helgdagar!I$2:K$24,3,FALSE),\"\")","v":""}]
["","2018-12-22","Lördag",null,0,0,{"$f":"IFERROR(VLOOKUP(B371,Helgdagar!A$2:C$24,3,FALSE),\"\")&\nIFERROR(VLOOKUP(B371,Helgdagar!E$2:G$24,3,FALSE),\"\")&\nIFERROR(VLOOKUP(B371,Helgdagar!I$2:K$24,3,FALSE),\"\")","v":""}]
["","2018-12-23","Söndag",null,0,0,{"$f":"IFERROR(VLOOKUP(B372,Helgdagar!A$2:C$24,3,FALSE),\"\")&\nIFERROR(VLOOKUP(B372,Helgdagar!E$2:G$24,3,FALSE),\"\")&\nIFERROR(VLOOKUP(B372,Helgdagar!I$2:K$24,3,FALSE),\"\")","v":""}]
["V. 52","2018-12-24","Måndag",null,0,0,{"$f":"IFERROR(VLOOKUP(B373,Helgdagar!A$2:C$24,3,FALSE),\"\")&\nIFERROR(VLOOKUP(B373,Helgdagar!E$2:G$24,3,FALSE),\"\")&\nIFERROR(VLOOKUP(B373,Helgdagar!I$2:K$24,3,FALSE),\"\")","v":"Julafton"}]
["","2018-12-25","Tisdag",null,0,0,{"$f":"IFERROR(VLOOKUP(B374,Helgdagar!A$2:C$24,3,FALSE),\"\")&\nIFERROR(VLOOKUP(B374,Helgdagar!E$2:G$24,3,FALSE),\"\")&\nIFERROR(VLOOKUP(B374,Helgdagar!I$2:K$24,3,FALSE),\"\")","v":"Juldagen"}]
["","2018-12-26","Onsdag",null,0,0,{"$f":"IFERROR(VLOOKUP(B375,Helgdagar!A$2:C$24,3,FALSE),\"\")&\nIFERROR(VLOOKUP(B375,Helgdagar!E$2:G$24,3,FALSE),\"\")&\nIFERROR(VLOOKUP(B375,Helgdagar!I$2:K$24,3,FALSE),\"\")","v":"Annandag jul"}]
["","2018-12-27","Torsdag",null,0,0,{"$f":"IFERROR(VLOOKUP(B376,Helgdagar!A$2:C$24,3,FALSE),\"\")&\nIFERROR(VLOOKUP(B376,Helgdagar!E$2:G$24,3,FALSE),\"\")&\nIFERROR(VLOOKUP(B376,Helgdagar!I$2:K$24,3,FALSE),\"\")","v":""}]
["","2018-12-28","Fredag",null,0,0,{"$f":"IFERROR(VLOOKUP(B377,Helgdagar!A$2:C$24,3,FALSE),\"\")&\nIFERROR(VLOOKUP(B377,Helgdagar!E$2:G$24,3,FALSE),\"\")&\nIFERROR(VLOOKUP(B377,Helgdagar!I$2:K$24,3,FALSE),\"\")","v":""}]
["","2018-12-29","Lördag",null,0,0,{"$f":"IFERROR(VLOOKUP(B378,Helgdagar!A$2:C$24,3,FALSE),\"\")&\nIFERROR(VLOOKUP(B378,Helgdagar!E$2:G$24,3,FALSE),\"\")&\nIFERROR(VLOOKUP(B378,Helgdagar!I$2:K$24,3,FALSE),\"\")","v":""}]
["","2018-12-30","Söndag",null,0,0,{"$f":"IFERROR(VLOOKUP(B379,Helgdagar!A$2:C$24,3,FALSE),\"\")&\nIFERROR(VLOOKUP(B379,Helgdagar!E$2:G$24,3,FALSE),\"\")&\nIFERROR(VLOOKUP(B379,Helgdagar!I$2:K$24,3,FALSE),\"\")","v":""}]
["V. 1","2018-12-31","Måndag",null,0,0,{"$f":"IFERROR(VLOOKUP(B380,Helgdagar!A$2:C$24,3,FALSE),\"\")&\nIFERROR(VLOOKUP(B380,Helgdagar!E$2:G$24,3,FALSE),\"\")&\nIFERROR(VLOOKUP(B380,Helgdagar!I$2:K$24,3,FALSE),\"\")","v":"Nyårsafton"}]
["",{"$f":"IF(YEAR(B380)=YEAR(B380+1),B380+1,0)","v":"00:00:00"},{"$f":"IF(YEAR(B380)=YEAR(B380+1),PROPER(TEXT(B381,\"dddd\")),\"\")","v":""},null,{"$f":"IF(AND(ISNUMBER(D381),B381>0),IF($C$2,TEXT(TEXT(D381,\"00\\:00\"),\"[t]:mm\"),\n(TEXT(D381,\"00\\:00\"))*24),0)","v":0},0,{"$f":"IFERROR(VLOOKUP(B381,Helgdagar!A$2:C$24,3,FALSE),\"\")&\nIFERROR(VLOOKUP(B381,Helgdagar!E$2:G$24,3,FALSE),\"\")&\nIFERROR(VLOOKUP(B381,Helgdagar!I$2:K$24,3,FALSE),\"\")","v":""}]

{"sheet":"Instruktion","index":1,"n_rows":0,"n_cols":0,"rows_kept":0,"cut":false,"hidden":true,"merged":[]}

{"sheet":"Makroaktivering","index":2,"n_rows":0,"n_cols":0,"rows_kept":0,"cut":false,"hidden":false,"merged":[]}

{"sheet":"Helgdagar","index":3,"n_rows":35,"n_cols":18,"rows_kept":35,"cut":false,"hidden":true,"merged":[[0,0,0,2],[0,4,0,6],[0,8,0,10],[14,12,21,14]]}
["Fredagslistor",null,null,null,"Lördagslistor",null,null,null,"Söndagslistor",null,null,null,{"$f":"DATE(StartÅr,1,1)","v":"2018-01-01"},{"$f":"IF(ISNUMBER(M1),TEXT(M1,\"dddd\"),\"\")","v":"måndag"},"Nyårsdagen"]
[null,null,null,null,{"$f":"IF(OR(WEEKDAY(DATE(StartÅr,1,1))=6,WEEKDAY(DATE(StartÅr,1,1))=7),DATE(StartÅr,1,1),\"\")","v":""},{"$f":"IF(ISNUMBER(E2),TEXT(E2,\"dddd\"),\"\")","v":""},{"$f":"IF(ISNUMBER(E2),\"Nyårsdagen\",\"\")","v":""},null,{"$f":"IF(OR(WEEKDAY(DATE(StartÅr,1,1))=1,WEEKDAY(DATE(StartÅr,1,1))=2,WEEKDAY(DATE(StartÅr,1,1))=3,WEEKDAY(DATE(StartÅr,1,1))=4,WEEKDAY(DATE(StartÅr,1,1))=5),DATE(StartÅr,1,1),\"\")","v":"2018-01-01"},{"$f":"IF(ISNUMBER(I2),TEXT(I2,\"dddd\"),\"\")","v":"måndag"},{"$f":"IF(ISNUMBER(I2),\"Nyårsdagen\",\"\")","v":"Nyårsdagen"},null,{"$f":"DATE(StartÅr,1,6)","v":"2018-01-06"},{"$f":"IF(ISNUMBER(M2),TEXT(M2,\"dddd\"),\"\")","v":"lördag"},"Trettondedag jul"]
[{"$f":"IF(OR(WEEKDAY(DATE(StartÅr,1,6))=3,WEEKDAY(DATE(StartÅr,1,6))=4,WEEKDAY(DATE(StartÅr,1,6))=5,WEEKDAY(DATE(StartÅr,1,6))=6,WEEKDAY(DATE(StartÅr,1,6))=7),DATE(StartÅr,1,5),\"\")","v":"2018-01-05"},{"$f":"IF(ISNUMBER(A3),TEXT(A3,\"dddd\"),\"\")","v":"fredag"},null,null,{"$f":"IF(WEEKDAY(DATE(StartÅr,1,5))=1,DATE(StartÅr,1,5),\"\")","v":""},{"$f":"IF(ISNUMBER(E3),TEXT(E3,\"dddd\"),\"\")","v":""},null,null,null,null,null,null,{"$f":"M4-2","v":"2018-03-30"},"fredag","Långfredagen",null,null,"ELLER(VECKODAG($A14)=1;ICKE(ÄRSAKNAD(LETARAD($A14;Blad2!A1:A13;1;FALSKT))))"]
[null,null,null,null,{"$f":"IF(OR(WEEKDAY(DATE(StartÅr,1,6))=6,WEEKDAY(DATE(StartÅr,1,6))=7),DATE(StartÅr,1,6),\"\")","v":"2018-01-06"},{"$f":"IF(ISNUMBER(E4),TEXT(E4,\"dddd\"),\"\")","v":"lördag"},{"$f":"IF(ISNUMBER(E4),\"Trettondedag jul\",\"\")","v":"Trettondedag jul"},null,{"$f":"IF(OR(WEEKDAY(DATE(StartÅr,1,6))=1,WEEKDAY(DATE(StartÅr,1,6))=2,WEEKDAY(DATE(StartÅr,1,6))=3,WEEKDAY(DATE(StartÅr,1,6))=4,WEEKDAY(DATE(StartÅr,1,6))=5),DATE(StartÅr,1,6),\"\")","v":""},{"$f":"IF(ISNUMBER(I4),TEXT(I4,\"dddd\"),\"\")","v":""},{"$f":"IF(ISNUMBER(I4),\"Trettondedag jul\",\"\")","v":""},null,{"$f":"M5-1","v":"2018-04-01"},"söndag","Påskdagen"]
[{"$f":"I9-4","v":"2018-03-29"},{"$f":"IF(ISNUMBER(A5),TEXT(A5,\"dddd\"),\"\")","v":"torsdag"},"Skärtorsdagen",null,null,null,null,null,null,null,null,null,{"$f":"FLOOR(StartÅr&\"-05-\"&DAY(MINUTE(StartÅr/38)/2+56),7)-33","v":"2018-04-02"},"måndag","Annandag påsk"]
[null,null,null,null,{"$f":"I9-3","v":"2018-03-30"},{"$f":"IF(ISNUMBER(E6),TEXT(E6,\"dddd\"),\"\")","v":"fredag"},"Långfredagen",null,null,null,null,null,{"$f":"DATE(StartÅr,5,1)","v":"2018-05-01"},"tisdag","Första maj"]
[null,null,null,null,{"$f":"I9-2","v":"2018-03-31"},{"$f":"IF(ISNUMBER(E7),TEXT(E7,\"dddd\"),\"\")","v":"lördag"},"Påskafton",null,null,null,null,null,{"$f":"FLOOR(StartÅr&\"-05-\"&DAY(MINUTE(StartÅr/38)/2+56),7)-34+39","v":"2018-05-10"},"torsdag","Kristi himmelfärdsdagen"]
[null,null,null,null,{"$f":"I9-1","v":"2018-04-01"},{"$f":"IF(ISNUMBER(E8),TEXT(E8,\"dddd\"),\"\")","v":"söndag"},"Påskdagen",null,null,null,null,null,{"$f":"FLOOR(StartÅr&\"-05-\"&DAY(MINUTE(StartÅr/38)/2+56),7)+15","v":"2018-05-20"},"söndag","Pingstdagen"]
[null,null,null,null,null,null,null,null,{"$f":"FLOOR(StartÅr&\"-05-\"&DAY(MINUTE(StartÅr/38)/2+56),7)-33","v":"2018-04-02"},{"$f":"IF(ISNUMBER(I9),TEXT(I9,\"dddd\"),\"\")","v":"måndag"},"Annandag påsk",null,{"$f":"DATE(StartÅr,6,6)","v":"2018-06-06"},"onsdag","Sveriges nationaldag"]
[{"$f":"IF(NOT(OR(ISNUMBER(E10),ISNUMBER(I10))),DATE(StartÅr,4,30),\"\")","v":"2018-04-30"},{"$f":"IF(ISNUMBER(A10),TEXT(A10,\"dddd\"),\"\")","v":"måndag"},{"$f":"IF(ISNUMBER(A10),\"Valborgsmässafton\",\"\")","v":"Valborgsmässafton"},null,{"$f":"IF(OR(WEEKDAY(DATE(StartÅr,4,30))=1,WEEKDAY(DATE(StartÅr,4,30))=7),DATE(StartÅr,4,30),\"\")","v":""},{"$f":"IF(ISNUMBER(E10),TEXT(E10,\"dddd\"),\"\")","v":""},{"$f":"IF(ISNUMBER(E10),\"Valborgsmässafton\",\"\")","v":""},null,null,null,null,null,{"$f":"DATE(StartÅr,6,1)+IF(2<WEEKDAY(DATE(StartÅr,6,1)),7-WEEKDAY(DATE(StartÅr,6,1))+2,2-WEEKDAY(DATE(StartÅr,6,1)))+((3-1)*7)+4+1","v":"2018-06-23"},"lördag","Midsommardagen"]
[null,null,null,null,{"$f":"IF(OR(WEEKDAY(DATE(StartÅr,5,1))=6,WEEKDAY(DATE(StartÅr,5,1))=7),DATE(StartÅr,5,1),\"\")","v":""},{"$f":"IF(ISNUMBER(E11),TEXT(E11,\"dddd\"),\"\")","v":""},{"$f":"IF(ISNUMBER(E11),\"Första maj\",\"\")","v":""},null,{"$f":"IF(OR(WEEKDAY(DATE(StartÅr,5,1))=1,WEEKDAY(DATE(StartÅr,5,1))=2,WEEKDAY(DATE(StartÅr,5,1))=3,WEEKDAY(DATE(StartÅr,5,1))=4,WEEKDAY(DATE(StartÅr,5,1))=5),DATE(StartÅr,5,1),\"\")","v":"2018-05-01"},{"$f":"IF(ISNUMBER(I11),TEXT(I11,\"dddd\"),\"\")","v":"tisdag"},{"$f":"IF(ISNUMBER(I11),\"Första maj\",\"\")","v":"Första maj"},null,{"$f":"IF(WEEKDAY(DATE(StartÅr,10,31))=7,DATE(StartÅr,10,31),\nIF(WEEKDAY(DATE(StartÅr,11,1))=7,DATE(StartÅr,11,1),\nIF(WEEKDAY(DATE(StartÅr,11,2))=7,DATE(StartÅr,11,2),\nIF(WEEKDAY(DATE(StartÅr,11,3))=7,DATE(StartÅr,11,3),\nIF(WEEKDAY(DATE(StartÅr,11,4))=7,DATE(StartÅr,11,4),\nIF(WEEKDAY(DATE(StartÅr,11,5))=7,DATE(StartÅr,11,5),\nDATE(StartÅr,11,6)\n))))))","v":"2018-11-03"},"lördag","Alla helgons dag"]
[{"$f":"I12-1","v":"2018-05-09"},{"$f":"IF(ISNUMBER(A12),TEXT(A12,\"dddd\"),\"\")","v":"onsdag"},null,null,null,null,null,null,{"$f":"FLOOR(StartÅr&\"-05-\"&DAY(MINUTE(StartÅr/38)/2+56),7)-34+39","v":"2018-05-10"},{"$f":"IF(ISNUMBER(I12),TEXT(I12,\"dddd\"),\"\")","v":"torsdag"},"Kristi himmelfärdsdagen",null,{"$f":"DATE(StartÅr,12,25)","v":"2018-12-25"},"tisdag","Juldagen"]
[null,null,null,null,{"$f":"FLOOR(StartÅr&\"-05-\"&DAY(MINUTE(StartÅr/38)/2+56),7)+14","v":"2018-05-19"},{"$f":"IF(ISNUMBER(E13),TEXT(E13,\"dddd\"),\"\")","v":"lördag"},"Pingstafton",null,{"$f":"FLOOR(StartÅr&\"-05-\"&DAY(MINUTE(StartÅr/38)/2+56),7)+15","v":"2018-05-20"},{"$f":"IF(ISNUMBER(I13),TEXT(I13,\"dddd\"),\"\")","v":"söndag"},"Pingstdagen",null,{"$f":"DATE(StartÅr,12,26)","v":"2018-12-26"},"onsdag","Annandag jul"]
[{"$f":"IF(OR(WEEKDAY(DATE(StartÅr,6,6))=3,WEEKDAY(DATE(StartÅr,6,6))=4,WEEKDAY(DATE(StartÅr,6,6))=5,WEEKDAY(DATE(StartÅr,6,6))=6,WEEKDAY(DATE(StartÅr,6,6))=7),DATE(StartÅr,6,5),\"\")","v":"2018-06-05"},{"$f":"IF(ISNUMBER(A14),TEXT(A14,\"dddd\"),\"\")","v":"tisdag"},null,null,{"$f":"IF(WEEKDAY(DATE(StartÅr,6,5))=1,DATE(StartÅr,6,5),\"\")","v":""},""]
[null,null,null,null,{"$f":"IF(OR(WEEKDAY(DATE(StartÅr,6,6))=6,WEEKDAY(DATE(StartÅr,6,6))=7),DATE(StartÅr,6,6),\"\")","v":""},"",{"$f":"IF(ISNUMBER(E15),\"Sveriges nationaldag\",\"\")","v":""},null,{"$f":"IF(OR(WEEKDAY(DATE(StartÅr,6,6))=1,WEEKDAY(DATE(StartÅr,6,6))=2,WEEKDAY(DATE(StartÅr,6,6))=3,WEEKDAY(DATE(StartÅr,6,6))=4,WEEKDAY(DATE(StartÅr,6,6))=5),DATE(StartÅr,6,6),\"\")","v":"2018-06-06"},{"$f":"IF(ISNUMBER(I15),TEXT(I15,\"dddd\"),\"\")","v":"onsdag"},{"$f":"IF(ISNUMBER(I15),\"Sveriges nationaldag\",\"\")","v":"Sveriges nationaldag"},null,"Om någon helgdag infaller på samma dag som annan helgdag, kommer inte båda helgdagarna visas med namn i fridagsgrupper. Vid sådan händelse som exempelvis 2008, kommer kommer dessa dubbla dagar markeras i en färg med villkorsstyrd formatering här ovan. 2008 kommer enbart 1 maj synas i Fridagsgrupper."]
[{"$f":"E16-1","v":"2018-06-21"},{"$f":"IF(ISNUMBER(A16),TEXT(A16,\"dddd\"),\"\")","v":"torsdag"},null,null,{"$f":"DATE(StartÅr,6,1)+IF(2<WEEKDAY(DATE(StartÅr,6,1)),7-WEEKDAY(DATE(StartÅr,6,1))+2,2-WEEKDAY(DATE(StartÅr,6,1)))+((3-1)*7)+4","v":"2018-06-22"},"fredag","Midsommarafton"]
[null,null,null,null,{"$f":"E16+1","v":"2018-06-23"},{"$f":"IF(ISNUMBER(E17),TEXT(E17,\"dddd\"),\"\")","v":"lördag"},"Midsommardagen"]
[null,null,null,null,{"$f":"IF(WEEKDAY(DATE(StartÅr,10,31))=7,DATE(StartÅr,10,31),\nIF(WEEKDAY(DATE(StartÅr,11,1))=7,DATE(StartÅr,11,1),\nIF(WEEKDAY(DATE(StartÅr,11,2))=7,DATE(StartÅr,11,2),\nIF(WEEKDAY(DATE(StartÅr,11,3))=7,DATE(StartÅr,11,3),\nIF(WEEKDAY(DATE(StartÅr,11,4))=7,DATE(StartÅr,11,4),\nIF(WEEKDAY(DATE(StartÅr,11,5))=7,DATE(StartÅr,11,5),\nDATE(StartÅr,11,6)\n))))))","v":"2018-11-03"},"lördag","Alla helgons dag"]
[{"$f":"IF(OR(WEEKDAY(E20)=3,WEEKDAY(E20)=4,WEEKDAY(E20)=5,WEEKDAY(E20)=6,WEEKDAY(E20)=7),E20-1,\"\")","v":""},{"$f":"IF(ISNUMBER(A19),TEXT(A19,\"dddd\"),\"\")","v":""},null,null,{"$f":"IF(WEEKDAY(DATE(StartÅr,12,23))=1,DATE(StartÅr,12,23),\"\")","v":"2018-12-23"},"söndag"]
[null,null,null,null,{"$f":"DATE(StartÅr,12,24)","v":"2018-12-24"},"måndag","Julafton"]
[null,null,null,null,{"$f":"DATE(StartÅr,12,25)","v":"2018-12-25"},"tisdag","Juldagen"]
[null,null,null,null,{"$f":"IF(OR(WEEKDAY(DATE(StartÅr,12,26))=6,WEEKDAY(DATE(StartÅr,12,26))=7),DATE(StartÅr,12,26),\"\")","v":""},"",{"$f":"IF(ISNUMBER(E22),\"Annandag jul\",\"\")","v":""},null,{"$f":"IF(OR(WEEKDAY(DATE(StartÅr,12,26))=1,WEEKDAY(DATE(StartÅr,12,26))=2,WEEKDAY(DATE(StartÅr,12,26))=3,WEEKDAY(DATE(StartÅr,12,26))=4,WEEKDAY(DATE(StartÅr,12,26))=5),DATE(StartÅr,12,26),\"\")","v":"2018-12-26"},{"$f":"IF(ISNUMBER(I22),TEXT(I22,\"dddd\"),\"\")","v":"onsdag"},{"$f":"IF(ISNUMBER(I22),\"Annandag jul\",\"\")","v":"Annandag jul"}]
[{"$f":"IF(OR(WEEKDAY(E24)=3,WEEKDAY(E24)=4,WEEKDAY(E24)=5,WEEKDAY(E24)=6,WEEKDAY(E24)=7),E24-1,\"\")","v":""},{"$f":"IF(ISNUMBER(A23),TEXT(A23,\"dddd\"),\"\")","v":""},null,null,{"$f":"IF(WEEKDAY(DATE(StartÅr,12,30))=1,DATE(StartÅr,12,30),\"\")","v":"2018-12-30"},"söndag"]
[null,null,null,null,{"$f":"DATE(StartÅr,12,31)","v":"2018-12-31"},"måndag","Nyårsafton"]
[]
[]
[]
[]
[]
[]
[]
[]
[]
[]
[null,{"$f":"IF(ISNUMBER(A35),TEXT(A35,\"dddd\"),\"\")","v":""},{"$f":"IF(ISNUMBER(A35),\"Söndag/heldag med storhelgstillägg\",\"\")","v":""}]